null
SMILES: CC(C)c1oc2ccccc2c1Cc1ccc(cc1)C(=O)N[C@@H]1CNC[C@@H]1C(=O)NO
InChI Key: InChIKey=YJSYFCHNFUBPQY-VQTJNVASSA-N
Activity Spreadsheet -- Enzyme Inhibition Constant Data from BindingDB
Found 5 hits for monomerid = 26566
Trg + Lig
Ki
nM
ΔG°
kcal/mole
IC50
nM
Kd
nM
EC50/IC50
nM
koff
s-1
kon
M-1s-1
pHTemp
°C
Macrophage metalloelastase
(Homo sapiens (Human))
BDBM26566
((3S,4S)-3-N-hydroxy-4-N-(4-{[2-(propan-2-yl)-1-ben...)
Show SMILES CC(C)c1oc2ccccc2c1Cc1ccc(cc1)C(=O)N[C@@H]1CNC[C@@H]1C(=O)NO |r|
Show InChI InChI=1S/C24H27N3O4/c1-14(2)22-18(17-5-3-4-6-21(17)31-22)11-15-7-9-16(10-8-15)23(28)26-20-13-25-12-19(20)24(29)27-30/h3-10,14,19-20,25,30H,11-13H2,1-2H3,(H,26,28)(H,27,29)/t19-,20+/m0/s1
Reactome pathway
85n/an/an/an/an/an/an/an/a
Bristol-Myers Squibb Company
Assay Description
The compounds were tested for enzyme inhibition using fluorescence resonance energy transfer (FRET) assay. Fluorescence measurements were performed i...
Bioorg Med Chem Lett 18: 1958-62 (2008)
Article DOI: 10.1016/j.bmcl.2008.01.120
BindingDB Entry DOI: 10.7270/Q25B00SX
Stromelysin-1
(Homo sapiens (Human))
BDBM26566
((3S,4S)-3-N-hydroxy-4-N-(4-{[2-(propan-2-yl)-1-ben...)
Show SMILES CC(C)c1oc2ccccc2c1Cc1ccc(cc1)C(=O)N[C@@H]1CNC[C@@H]1C(=O)NO |r|
Show InChI InChI=1S/C24H27N3O4/c1-14(2)22-18(17-5-3-4-6-21(17)31-22)11-15-7-9-16(10-8-15)23(28)26-20-13-25-12-19(20)24(29)27-30/h3-10,14,19-20,25,30H,11-13H2,1-2H3,(H,26,28)(H,27,29)/t19-,20+/m0/s1
Reactome pathway
2.72E+3n/an/an/an/an/an/an/an/a
Bristol-Myers Squibb Company
Assay Description
The compounds were tested for enzyme inhibition using fluorescence resonance energy transfer (FRET) assay. Fluorescence measurements were performed i...
Bioorg Med Chem Lett 18: 1958-62 (2008)
Article DOI: 10.1016/j.bmcl.2008.01.120
BindingDB Entry DOI: 10.7270/Q25B00SX
72 kDa type IV collagenase
(Homo sapiens (Human))
BDBM26566
((3S,4S)-3-N-hydroxy-4-N-(4-{[2-(propan-2-yl)-1-ben...)
Show SMILES CC(C)c1oc2ccccc2c1Cc1ccc(cc1)C(=O)N[C@@H]1CNC[C@@H]1C(=O)NO |r|
Show InChI InChI=1S/C24H27N3O4/c1-14(2)22-18(17-5-3-4-6-21(17)31-22)11-15-7-9-16(10-8-15)23(28)26-20-13-25-12-19(20)24(29)27-30/h3-10,14,19-20,25,30H,11-13H2,1-2H3,(H,26,28)(H,27,29)/t19-,20+/m0/s1
Reactome pathway
>3.33E+3>-7.47n/an/an/an/an/a7.525
Bristol-Myers Squibb Company
Assay Description
The compounds were tested for enzyme inhibition using fluorescence resonance energy transfer (FRET) assay. Fluorescence measurements were performed i...
Bioorg Med Chem Lett 18: 1958-62 (2008)
Article DOI: 10.1016/j.bmcl.2008.01.120
BindingDB Entry DOI: 10.7270/Q25B00SX
Matrilysin
(Homo sapiens (Human))
BDBM26566
((3S,4S)-3-N-hydroxy-4-N-(4-{[2-(propan-2-yl)-1-ben...)
Show SMILES CC(C)c1oc2ccccc2c1Cc1ccc(cc1)C(=O)N[C@@H]1CNC[C@@H]1C(=O)NO |r|
Show InChI InChI=1S/C24H27N3O4/c1-14(2)22-18(17-5-3-4-6-21(17)31-22)11-15-7-9-16(10-8-15)23(28)26-20-13-25-12-19(20)24(29)27-30/h3-10,14,19-20,25,30H,11-13H2,1-2H3,(H,26,28)(H,27,29)/t19-,20+/m0/s1
Reactome pathway
>6.37E+3n/an/an/an/an/an/an/an/a
Bristol-Myers Squibb Company
Assay Description
The compounds were tested for enzyme inhibition using fluorescence resonance energy transfer (FRET) assay. Fluorescence measurements were performed i...
Bioorg Med Chem Lett 18: 1958-62 (2008)
Article DOI: 10.1016/j.bmcl.2008.01.120
BindingDB Entry DOI: 10.7270/Q25B00SX
Disintegrin and metalloproteinase domain-containing protein 17
(Sus scrofa (pig))
BDBM26566
((3S,4S)-3-N-hydroxy-4-N-(4-{[2-(propan-2-yl)-1-ben...)
Show SMILES CC(C)c1oc2ccccc2c1Cc1ccc(cc1)C(=O)N[C@@H]1CNC[C@@H]1C(=O)NO |r|
Show InChI InChI=1S/C24H27N3O4/c1-14(2)22-18(17-5-3-4-6-21(17)31-22)11-15-7-9-16(10-8-15)23(28)26-20-13-25-12-19(20)24(29)27-30/h3-10,14,19-20,25,30H,11-13H2,1-2H3,(H,26,28)(H,27,29)/t19-,20+/m0/s1
n/an/a 1.80n/an/an/an/a7.525
Bristol-Myers Squibb Company
Assay Description
The compounds were tested for enzyme inhibition using fluorescence resonance energy transfer (FRET) assay. Fluorescence measurements were performed i...
Bioorg Med Chem Lett 18: 1958-62 (2008)
Article DOI: 10.1016/j.bmcl.2008.01.120
BindingDB Entry DOI: 10.7270/Q25B00SX