BDBM265705 US9718790, I-1973
SMILES: CCn1c(=O)[nH]\c(=N/c2ccc(Oc3ccc(cc3)-c3ncn[nH]3)cc2)n(Cc2ccc(Cl)cc2)c1=O
InChI Key: InChIKey=KRCHSRSVJSOCOQ-UHFFFAOYSA-N
Data: 1 IC50
Activity Spreadsheet -- Enzyme Inhibition Constant Data from BindingDB
Found 1 hit for monomerid = 265705
Trg + Lig
Ki
nM
ΔG°
kcal/mole
IC50
nM
Kd
nM
EC50/IC50
nM
koff
s-1
kon
M-1s-1
pHTemp
°C
P2X purinoceptor 3
(Homo sapiens (Human))
BDBM265705
(US9718790, I-1973)
Show SMILES CCn1c(=O)[nH]\c(=N/c2ccc(Oc3ccc(cc3)-c3ncn[nH]3)cc2)n(Cc2ccc(Cl)cc2)c1=O
Show InChI InChI=1S/C26H22ClN7O3/c1-2-33-25(35)31-24(34(26(33)36)15-17-3-7-19(27)8-4-17)30-20-9-13-22(14-10-20)37-21-11-5-18(6-12-21)23-28-16-29-32-23/h3-14,16H,2,15H2,1H3,(H,28,29,32)(H,30,31,35)
US Patent
n/an/a 2n/an/an/an/a7.5n/a
SHIONOGI & CO., LTD.
US Patent
Assay Description
Stably expressing cell line (C6BU-1 transfected with human P2X3 receptor gene (GenBank accession number Y07683) was used. The cells were seeded in a ...
US Patent US9718790 (2017)
BindingDB Entry DOI: 10.7270/Q22809KB