BDBM26576 3-[1-(carboxymethyl)-5-(4-chlorophenyl)-1H-pyrrol-2-yl]propanoic acid::H1NI2, 1
SMILES: OC(=O)CCc1ccc(-c2ccc(Cl)cc2)n1CC(O)=O
InChI Key: InChIKey=HVRPIHVDCLVETM-UHFFFAOYSA-N
Data: 1 IC50
Activity Spreadsheet -- Enzyme Inhibition Constant Data from BindingDB
Found 1 hit for monomerid = 26576
Trg + Lig
Ki
nM
ΔG°
kcal/mole
IC50
nM
Kd
nM
EC50/IC50
nM
koff
s-1
kon
M-1s-1
pHTemp
°C
Apurinic-apyrimidinic endonuclease 1 (APE-1)
(Homo sapiens (Human))
BDBM26576
(3-[1-(carboxymethyl)-5-(4-chlorophenyl)-1H-pyrrol-...)
Show SMILES OC(=O)CCc1ccc(-c2ccc(Cl)cc2)n1CC(O)=O
Show InChI InChI=1S/C15H14ClNO4/c16-11-3-1-10(2-4-11)13-7-5-12(6-8-14(18)19)17(13)9-15(20)21/h1-5,7H,6,8-9H2,(H,18,19)(H,20,21)
Reactome pathway
n/an/a 4.00E+3n/an/an/an/a7.530
University of Southern California
Assay Description
To determine the extent of abasic residue cleavage by APE1, recombinant APE1 was preincubated with the potential inhibitors in reaction buffer. Then,...
J Med Chem 52: 20-32 (2009)
Article DOI: 10.1021/jm800739m
BindingDB Entry DOI: 10.7270/Q21J9822