BDBM26582 2-[3-(carboxymethyl)-2-oxo-2,3-dihydro-1H-1,3-benzodiazol-1-yl]acetic acid::H1-A1NI2, 7
SMILES: OC(=O)Cn1c2ccccc2n(CC(O)=O)c1=O
InChI Key: InChIKey=JMTPLUIWGNLLNB-UHFFFAOYSA-N
Data: 1 IC50
Activity Spreadsheet -- Enzyme Inhibition Constant Data from BindingDB
Found 1 hit for monomerid = 26582
Trg + Lig
Ki
nM
ΔG°
kcal/mole
IC50
nM
Kd
nM
EC50/IC50
nM
koff
s-1
kon
M-1s-1
pHTemp
°C
Apurinic-apyrimidinic endonuclease 1 (APE-1)
(Homo sapiens (Human))
BDBM26582
(2-[3-(carboxymethyl)-2-oxo-2,3-dihydro-1H-1,3-benz...)
Show SMILES OC(=O)Cn1c2ccccc2n(CC(O)=O)c1=O
Show InChI InChI=1S/C11H10N2O5/c14-9(15)5-12-7-3-1-2-4-8(7)13(11(12)18)6-10(16)17/h1-4H,5-6H2,(H,14,15)(H,16,17)
Reactome pathway
n/an/a 1.60E+4n/an/an/an/a7.530
University of Southern California
Assay Description
To determine the extent of abasic residue cleavage by APE1, recombinant APE1 was preincubated with the potential inhibitors in reaction buffer. Then,...
J Med Chem 52: 20-32 (2009)
Article DOI: 10.1021/jm800739m
BindingDB Entry DOI: 10.7270/Q21J9822