BDBM26592 4-(2-carboxyphenoxymethyl)-2,5-dimethylfuran-3-carboxylic acid::A1NI2-A3NI1,17
SMILES: Cc1oc(C)c(C(O)=O)c1COc1ccccc1C(O)=O
InChI Key: InChIKey=XBEWKMLRXDLXCW-UHFFFAOYSA-N
Data: 1 IC50
Activity Spreadsheet -- Enzyme Inhibition Constant Data from BindingDB
Found 1 hit for monomerid = 26592
Trg + Lig
Ki
nM
ΔG°
kcal/mole
IC50
nM
Kd
nM
EC50/IC50
nM
koff
s-1
kon
M-1s-1
pHTemp
°C
Apurinic-apyrimidinic endonuclease 1 (APE-1)
(Homo sapiens (Human))
BDBM26592
(4-(2-carboxyphenoxymethyl)-2,5-dimethylfuran-3-car...)
Show SMILES Cc1oc(C)c(C(O)=O)c1COc1ccccc1C(O)=O
Show InChI InChI=1S/C15H14O6/c1-8-11(13(15(18)19)9(2)21-8)7-20-12-6-4-3-5-10(12)14(16)17/h3-6H,7H2,1-2H3,(H,16,17)(H,18,19)
Reactome pathway
n/an/a 6.00E+3n/an/an/an/a7.530
University of Southern California
Assay Description
To determine the extent of abasic residue cleavage by APE1, recombinant APE1 was preincubated with the potential inhibitors in reaction buffer. Then,...
J Med Chem 52: 20-32 (2009)
Article DOI: 10.1021/jm800739m
BindingDB Entry DOI: 10.7270/Q21J9822