BDBM266476 US9718790, I-1519
SMILES: CCOC(=O)CCn1c(=O)[nH]\c(=N/c2ccc3nc(C)sc3c2)n(Cc2ccc(C)cc2)c1=O
InChI Key: InChIKey=QLRLCKSOODOJGP-UHFFFAOYSA-N
Data: 1 IC50
Activity Spreadsheet -- Enzyme Inhibition Constant Data from BindingDB
Found 1 hit for monomerid = 266476
Trg + Lig
Ki
nM
ΔG°
kcal/mole
IC50
nM
Kd
nM
EC50/IC50
nM
koff
s-1
kon
M-1s-1
pHTemp
°C
P2X purinoceptor 3
(Homo sapiens (Human))
BDBM266476
(US9718790, I-1519)
Show SMILES CCOC(=O)CCn1c(=O)[nH]\c(=N/c2ccc3nc(C)sc3c2)n(Cc2ccc(C)cc2)c1=O
Show InChI InChI=1S/C24H25N5O4S/c1-4-33-21(30)11-12-28-23(31)27-22(26-18-9-10-19-20(13-18)34-16(3)25-19)29(24(28)32)14-17-7-5-15(2)6-8-17/h5-10,13H,4,11-12,14H2,1-3H3,(H,26,27,31)
US Patent
n/an/a 2n/an/an/an/a7.5n/a
SHIONOGI & CO., LTD.
US Patent
Assay Description
Stably expressing cell line (C6BU-1 transfected with human P2X3 receptor gene (GenBank accession number Y07683) was used. The cells were seeded in a ...
US Patent US9718790 (2017)
BindingDB Entry DOI: 10.7270/Q22809KB