BDBM266480 US9718790, I-2269
SMILES: CCn1c(=O)[nH]\c(=N/c2ccc(Oc3ccc(nn3)C(=O)OC)cc2)n(Cc2ccc(Cl)cc2)c1=O
InChI Key: InChIKey=RHWKADCUUNQCMX-UHFFFAOYSA-N
Data: 1 IC50
Activity Spreadsheet -- Enzyme Inhibition Constant Data from BindingDB
Found 1 hit for monomerid = 266480
Trg + Lig
Ki
nM
ΔG°
kcal/mole
IC50
nM
Kd
nM
EC50/IC50
nM
koff
s-1
kon
M-1s-1
pHTemp
°C
P2X purinoceptor 3
(Homo sapiens (Human))
BDBM266480
(US9718790, I-2269)
Show SMILES CCn1c(=O)[nH]\c(=N/c2ccc(Oc3ccc(nn3)C(=O)OC)cc2)n(Cc2ccc(Cl)cc2)c1=O
Show InChI InChI=1S/C24H21ClN6O5/c1-3-30-23(33)27-22(31(24(30)34)14-15-4-6-16(25)7-5-15)26-17-8-10-18(11-9-17)36-20-13-12-19(28-29-20)21(32)35-2/h4-13H,3,14H2,1-2H3,(H,26,27,33)
US Patent
n/an/a 2n/an/an/an/a7.5n/a
SHIONOGI & CO., LTD.
US Patent
Assay Description
Stably expressing cell line (C6BU-1 transfected with human P2X3 receptor gene (GenBank accession number Y07683) was used. The cells were seeded in a ...
US Patent US9718790 (2017)
BindingDB Entry DOI: 10.7270/Q22809KB