BDBM266536 US9718790, I-2288
SMILES: Clc1ccc(Cn2c(=O)n(CCOC3CCCCO3)c(=O)[nH]\c2=N/c2ccc(Oc3ccon3)cc2)cc1
InChI Key:
Data: 1 IC50
Activity Spreadsheet -- Enzyme Inhibition Constant Data from BindingDB
Found 1 hit for monomerid = 266536
Trg + Lig
Ki
nM
ΔG°
kcal/mole
IC50
nM
Kd
nM
EC50/IC50
nM
koff
s-1
kon
M-1s-1
pHTemp
°C
P2X purinoceptor 3
(Homo sapiens (Human))
BDBM266536
(US9718790, I-2288)
Show SMILES Clc1ccc(Cn2c(=O)n(CCOC3CCCCO3)c(=O)[nH]\c2=N/c2ccc(Oc3ccon3)cc2)cc1
US Patent
n/an/a 1n/an/an/an/a7.5n/a
SHIONOGI & CO., LTD.
US Patent
Assay Description
Stably expressing cell line (C6BU-1 transfected with human P2X3 receptor gene (GenBank accession number Y07683) was used. The cells were seeded in a ...
US Patent US9718790 (2017)
BindingDB Entry DOI: 10.7270/Q22809KB