BDBM266936 US9718790, I-2682
SMILES: COC(=O)CCn1c(=O)[nH]\c(=N/c2ccc(Oc3cccc(n3)C(N)=O)cc2)n(Cc2ccc(C)cc2)c1=O
InChI Key: InChIKey=PRKOXLJKFCFNFA-UHFFFAOYSA-N
Data: 1 IC50
Activity Spreadsheet -- Enzyme Inhibition Constant Data from BindingDB
Found 1 hit for monomerid = 266936
Trg + Lig
Ki
nM
ΔG°
kcal/mole
IC50
nM
Kd
nM
EC50/IC50
nM
koff
s-1
kon
M-1s-1
pHTemp
°C
P2X purinoceptor 3
(Homo sapiens (Human))
BDBM266936
(US9718790, I-2682)
Show SMILES COC(=O)CCn1c(=O)[nH]\c(=N/c2ccc(Oc3cccc(n3)C(N)=O)cc2)n(Cc2ccc(C)cc2)c1=O
Show InChI InChI=1S/C27H26N6O6/c1-17-6-8-18(9-7-17)16-33-25(31-26(36)32(27(33)37)15-14-23(34)38-2)29-19-10-12-20(13-11-19)39-22-5-3-4-21(30-22)24(28)35/h3-13H,14-16H2,1-2H3,(H2,28,35)(H,29,31,36)
US Patent
n/an/a 2n/an/an/an/a7.5n/a
SHIONOGI & CO., LTD.
US Patent
Assay Description
Stably expressing cell line (C6BU-1 transfected with human P2X3 receptor gene (GenBank accession number Y07683) was used. The cells were seeded in a ...
US Patent US9718790 (2017)
BindingDB Entry DOI: 10.7270/Q22809KB