BDBM26698 7-chloro-6-fluoro-9-(propan-2-yl)-1H,3H,4H,9H-quinolino[2,3-c][1,2]oxazole-3,4-dione::Isoxazoloquinolinedione, 6
SMILES: CC(C)n1c2noc(=O)c2c(O)c2cc(F)c(Cl)cc12
InChI Key: InChIKey=UDSJMCNBYOMONW-UHFFFAOYSA-N
Data: 2 KI
Activity Spreadsheet -- Enzyme Inhibition Constant Data from BindingDB
Found 2 hits for monomerid = 26698
Trg + Lig
Ki
nM
ΔG°
kcal/mole
IC50
nM
Kd
nM
EC50/IC50
nM
koff
s-1
kon
M-1s-1
pHTemp
°C
Serine/threonine-protein kinase pim-1
(Homo sapiens (Human))
BDBM26698
(7-chloro-6-fluoro-9-(propan-2-yl)-1H,3H,4H,9H-quin...)
Show SMILES CC(C)n1c2noc(=O)c2c(O)c2cc(F)c(Cl)cc12
Show InChI InChI=1S/C13H10ClFN2O3/c1-5(2)17-9-4-7(14)8(15)3-6(9)11(18)10-12(17)16-20-13(10)19/h3-5,18H,1-2H3
12.3 -10.7n/an/an/an/an/a7.522
Abbott Laboratories
Assay Description
Assays were conducted in 384-well v-bottom polypropylene plates. Test compound was mixed with Pim and biotinylated peptide substrate, followed by imm...
Bioorg Med Chem Lett 18: 5206-8 (2008)
Article DOI: 10.1016/j.bmcl.2008.08.079
BindingDB Entry DOI: 10.7270/Q2833QBF
Serine/threonine-protein kinase pim-2
(Homo sapiens (Human))
BDBM26698
(7-chloro-6-fluoro-9-(propan-2-yl)-1H,3H,4H,9H-quin...)
Show SMILES CC(C)n1c2noc(=O)c2c(O)c2cc(F)c(Cl)cc12
Show InChI InChI=1S/C13H10ClFN2O3/c1-5(2)17-9-4-7(14)8(15)3-6(9)11(18)10-12(17)16-20-13(10)19/h3-5,18H,1-2H3
62.8 -9.72n/an/an/an/an/a7.522
Abbott Laboratories
Assay Description
Assays were conducted in 384-well v-bottom polypropylene plates. Test compound was mixed with Pim and biotinylated peptide substrate, followed by imm...
Bioorg Med Chem Lett 18: 5206-8 (2008)
Article DOI: 10.1016/j.bmcl.2008.08.079
BindingDB Entry DOI: 10.7270/Q2833QBF