BDBM267 (3S)-3-{[6-(benzenesulfonamidomethyl)pyridin-3-yl]formamido}-4-oxobutanoic acid::(S)-3-{[6-(Benzenesulfonylamino-methyl)pyridine-3-carbonyl]amino}-4-oxo-butyric Acid Trifluoroacetate::Inhibitor 48::Pyridine Scaffold 48
SMILES: OC(=O)C[C@H](NC(=O)c1ccc(CNS(=O)(=O)c2ccccc2)nc1)C=O
InChI Key: InChIKey=OKXHJSNMCKNGQC-AWEZNQCLSA-N
Data: 1 KI
Activity Spreadsheet -- Enzyme Inhibition Constant Data from BindingDB
Found 1 hit for monomerid = 267
Trg + Lig
Ki
nM
ΔG°
kcal/mole
IC50
nM
Kd
nM
EC50/IC50
nM
koff
s-1
kon
M-1s-1
pHTemp
°C
Caspase-3
(Homo sapiens (Human))
BDBM267
((3S)-3-{[6-(benzenesulfonamidomethyl)pyridin-3-yl]...)
Show SMILES OC(=O)C[C@H](NC(=O)c1ccc(CNS(=O)(=O)c2ccccc2)nc1)C=O |r|
Show InChI InChI=1S/C17H17N3O6S/c21-11-14(8-16(22)23)20-17(24)12-6-7-13(18-9-12)10-19-27(25,26)15-4-2-1-3-5-15/h1-7,9,11,14,19H,8,10H2,(H,20,24)(H,22,23)/t14-/m0/s1
NCI pathway
Reactome pathway
1.70E+3 -7.87n/an/an/an/an/a7.425
Sunesis Pharmaceuticals
J Med Chem 45: 5005-22 (2002)
Article DOI: 10.1021/jm020230j
BindingDB Entry DOI: 10.7270/Q2B56GW5