BDBM26703 7-chloro-9-ethyl-6-fluoro-1-[(3-hydroxyphenyl)methyl]-1H,3H,4H,9H-quinolino[2,3-c][1,2]oxazole-3,4-dione::Isoxazoloquinolinedione, 11
SMILES: CCn1c2n(Cc3cccc(O)c3)oc(=O)c2c(=O)c2cc(F)c(Cl)cc12
InChI Key: InChIKey=GHCJUDZBDUVDGX-UHFFFAOYSA-N
Data: 2 KI
Activity Spreadsheet -- Enzyme Inhibition Constant Data from BindingDB
Found 2 hits for monomerid = 26703
Trg + Lig
Ki
nM
ΔG°
kcal/mole
IC50
nM
Kd
nM
EC50/IC50
nM
koff
s-1
kon
M-1s-1
pHTemp
°C
Serine/threonine-protein kinase pim-1
(Homo sapiens (Human))
BDBM26703
(7-chloro-9-ethyl-6-fluoro-1-[(3-hydroxyphenyl)meth...)
Show SMILES CCn1c2n(Cc3cccc(O)c3)oc(=O)c2c(=O)c2cc(F)c(Cl)cc12
Show InChI InChI=1S/C19H14ClFN2O4/c1-2-22-15-8-13(20)14(21)7-12(15)17(25)16-18(22)23(27-19(16)26)9-10-4-3-5-11(24)6-10/h3-8,24H,2,9H2,1H3
271 -8.86n/an/an/an/an/a7.522
Abbott Laboratories
Assay Description
Assays were conducted in 384-well v-bottom polypropylene plates. Test compound was mixed with Pim and biotinylated peptide substrate, followed by imm...
Bioorg Med Chem Lett 18: 5206-8 (2008)
Article DOI: 10.1016/j.bmcl.2008.08.079
BindingDB Entry DOI: 10.7270/Q2833QBF
Serine/threonine-protein kinase pim-2
(Homo sapiens (Human))
BDBM26703
(7-chloro-9-ethyl-6-fluoro-1-[(3-hydroxyphenyl)meth...)
Show SMILES CCn1c2n(Cc3cccc(O)c3)oc(=O)c2c(=O)c2cc(F)c(Cl)cc12
Show InChI InChI=1S/C19H14ClFN2O4/c1-2-22-15-8-13(20)14(21)7-12(15)17(25)16-18(22)23(27-19(16)26)9-10-4-3-5-11(24)6-10/h3-8,24H,2,9H2,1H3
>1.42E+3>-7.89n/an/an/an/an/a7.522
Abbott Laboratories
Assay Description
Assays were conducted in 384-well v-bottom polypropylene plates. Test compound was mixed with Pim and biotinylated peptide substrate, followed by imm...
Bioorg Med Chem Lett 18: 5206-8 (2008)
Article DOI: 10.1016/j.bmcl.2008.08.079
BindingDB Entry DOI: 10.7270/Q2833QBF