null
SMILES: COCC(C)OC(=O)c1ccc(NS(=O)(=O)c2cc(Cl)c(Cl)s2)cc1O
InChI Key: InChIKey=MFDLCINPSKIGRF-UHFFFAOYSA-N
Activity Spreadsheet -- Enzyme Inhibition Constant Data from BindingDB
Found 1 hit for monomerid = 267065
Trg + Lig
Ki
nM
ΔG°
kcal/mole
IC50
nM
Kd
nM
EC50/IC50
nM
koff
s-1
kon
M-1s-1
pHTemp
°C
6-phosphofructo-2-kinase/fructose-2,6-bisphosphatase 4
(Homo sapiens (Human))
BDBM267065
(2-Methoxy-1-methylethyl 4-{[(4,5-dichlorothiophen-...)
Show SMILES COCC(C)OC(=O)c1ccc(NS(=O)(=O)c2cc(Cl)c(Cl)s2)cc1O
Show InChI InChI=1S/C15H15Cl2NO6S2/c1-8(7-23-2)24-15(20)10-4-3-9(5-12(10)19)18-26(21,22)13-6-11(16)14(17)25-13/h3-6,8,18-19H,7H2,1-2H3
US Patent
n/an/a 800n/an/an/an/an/an/a
Kancera AB
US Patent
Assay Description
6-phosphofructo-2-kinase/fructose-2,6-bisphosphatase (PFK-2/BPase-2) is a bi-functional enzyme that catalyses the formation and degradation of fructo...
US Patent US9718809 (2017)
BindingDB Entry DOI: 10.7270/Q28S4RXR