BDBM26712 1-(benzenesulfonyl)-N-[4-(6-methyl-1,3-benzothiazol-2-yl)phenyl]piperidine-4-carboxamide::benzothiazole analogue, 13d
SMILES: Cc1ccc2nc(sc2c1)-c1ccc(NC(=O)C2CCN(CC2)S(=O)(=O)c2ccccc2)cc1
InChI Key: InChIKey=CLNVCKFTJPHZLZ-UHFFFAOYSA-N
Data: 1 IC50
Activity Spreadsheet -- Enzyme Inhibition Constant Data from BindingDB
Found 1 hit for monomerid = 26712
Trg + Lig
Ki
nM
ΔG°
kcal/mole
IC50
nM
Kd
nM
EC50/IC50
nM
koff
s-1
kon
M-1s-1
pHTemp
°C
Fatty-acid amide hydrolase 1 (aa 30-579)
(Rattus norvegicus (rat))
BDBM26712
(1-(benzenesulfonyl)-N-[4-(6-methyl-1,3-benzothiazo...)
Show SMILES Cc1ccc2nc(sc2c1)-c1ccc(NC(=O)C2CCN(CC2)S(=O)(=O)c2ccccc2)cc1
Show InChI InChI=1S/C26H25N3O3S2/c1-18-7-12-23-24(17-18)33-26(28-23)20-8-10-21(11-9-20)27-25(30)19-13-15-29(16-14-19)34(31,32)22-5-3-2-4-6-22/h2-12,17,19H,13-16H2,1H3,(H,27,30)
n/an/a 13n/an/an/an/a8.022
Abbott Laboratories
Assay Description
[3H]anandamide was incubated with membranes to produce radiolabeled ethanolamine and unlabeled arachidonic acid. Charcoal selectively binds anandamid...
J Med Chem 52: 170-80 (2009)
Article DOI: 10.1021/jm801042a
BindingDB Entry DOI: 10.7270/Q24B2ZMQ