BDBM26786 3-(1,1-dioxo-1,2-thiazinan-2-yl)-5-(ethylamino)-2-fluoro-N-[(2S,3R)-3-hydroxy-4-{[(3-methoxyphenyl)methyl]amino}-1-phenylbutan-2-yl]benzamide::hydroxy ethylamine (HEA), 21
SMILES: CCNc1cc(N2CCCCS2(=O)=O)c(F)c(c1)C(=O)N[C@@H](Cc1ccccc1)[C@H](O)CNCc1cccc(OC)c1
InChI Key: InChIKey=UGVUREZIOUDVMM-LMSSTIIKSA-N
Data: 3 IC50
Activity Spreadsheet -- Enzyme Inhibition Constant Data from BindingDB
Found 3 hits for monomerid = 26786
Trg + Lig
Ki
nM
ΔG°
kcal/mole
IC50
nM
Kd
nM
EC50/IC50
nM
koff
s-1
kon
M-1s-1
pHTemp
°C
Beta-secretase 1
(Homo sapiens (Human))
BDBM26786
(3-(1,1-dioxo-1,2-thiazinan-2-yl)-5-(ethylamino)-2-...)
Show SMILES CCNc1cc(N2CCCCS2(=O)=O)c(F)c(c1)C(=O)N[C@@H](Cc1ccccc1)[C@H](O)CNCc1cccc(OC)c1 |r|
Show InChI InChI=1S/C31H39FN4O5S/c1-3-34-24-18-26(30(32)28(19-24)36-14-7-8-15-42(36,39)40)31(38)35-27(17-22-10-5-4-6-11-22)29(37)21-33-20-23-12-9-13-25(16-23)41-2/h4-6,9-13,16,18-19,27,29,33-34,37H,3,7-8,14-15,17,20-21H2,1-2H3,(H,35,38)/t27-,29+/m0/s1
n/an/a 4n/an/an/an/a4.522
GSK
Assay Description
Enzyme activity and inhibition were assayed using a fluorescent FAM-[SEVNLDAEFK]-TAMRA substrate. Control reactions with no enzyme were included in e...
Bioorg Med Chem Lett 18: 1022-6 (2008)
Article DOI: 10.1016/j.bmcl.2007.12.020
BindingDB Entry DOI: 10.7270/Q2MC8XBP
Cathepsin D
(Homo sapiens (Human))
BDBM26786
(3-(1,1-dioxo-1,2-thiazinan-2-yl)-5-(ethylamino)-2-...)
Show SMILES CCNc1cc(N2CCCCS2(=O)=O)c(F)c(c1)C(=O)N[C@@H](Cc1ccccc1)[C@H](O)CNCc1cccc(OC)c1 |r|
Show InChI InChI=1S/C31H39FN4O5S/c1-3-34-24-18-26(30(32)28(19-24)36-14-7-8-15-42(36,39)40)31(38)35-27(17-22-10-5-4-6-11-22)29(37)21-33-20-23-12-9-13-25(16-23)41-2/h4-6,9-13,16,18-19,27,29,33-34,37H,3,7-8,14-15,17,20-21H2,1-2H3,(H,35,38)/t27-,29+/m0/s1
NCI pathway
Reactome pathway
n/an/a 6.55E+3n/an/an/an/an/an/a
GSK
Assay Description
Enzyme activity and inhibition were assayed using a fluorescent FAM-[SEVNLDAEFK]-TAMRA substrate. Control reactions with no enzyme were included in e...
Bioorg Med Chem Lett 18: 1022-6 (2008)
Article DOI: 10.1016/j.bmcl.2007.12.020
BindingDB Entry DOI: 10.7270/Q2MC8XBP
Beta-secretase 2
(Homo sapiens (Human))
BDBM26786
(3-(1,1-dioxo-1,2-thiazinan-2-yl)-5-(ethylamino)-2-...)
Show SMILES CCNc1cc(N2CCCCS2(=O)=O)c(F)c(c1)C(=O)N[C@@H](Cc1ccccc1)[C@H](O)CNCc1cccc(OC)c1 |r|
Show InChI InChI=1S/C31H39FN4O5S/c1-3-34-24-18-26(30(32)28(19-24)36-14-7-8-15-42(36,39)40)31(38)35-27(17-22-10-5-4-6-11-22)29(37)21-33-20-23-12-9-13-25(16-23)41-2/h4-6,9-13,16,18-19,27,29,33-34,37H,3,7-8,14-15,17,20-21H2,1-2H3,(H,35,38)/t27-,29+/m0/s1
n/an/a 785n/an/an/an/an/an/a
GSK
Assay Description
Enzyme activity and inhibition were assayed using a fluorescent FAM-[SEVNLDAEFK]-TAMRA substrate. Control reactions with no enzyme were included in e...
Bioorg Med Chem Lett 18: 1022-6 (2008)
Article DOI: 10.1016/j.bmcl.2007.12.020
BindingDB Entry DOI: 10.7270/Q2MC8XBP