BDBM267998 4-[2-((R)-3-methylmorpholin-4-yl)-8-(2H-pyrazol-3-yl)-[1,7]naphthyridine-4-yl]phenyl-S-methylsulphoximide::US9549932, 30
SMILES: CCOC(=O)N=S(C)(=O)c1ccc(cc1)-c1cc(nc2c(nccc12)-c1ccnn1C1CCCCO1)N1CCOC[C@H]1C
InChI Key: InChIKey=QIFCFWHJBIXPLO-PDDUTZDDSA-N
Data: 2 IC50
Activity Spreadsheet -- Enzyme Inhibition Constant Data from BindingDB
Found 2 hits for monomerid = 267998
Trg + Lig
Ki
nM
ΔG°
kcal/mole
IC50
nM
Kd
nM
EC50/IC50
nM
koff
s-1
kon
M-1s-1
pHTemp
°C
Serine/threonine-protein kinase ATR
(Homo sapiens (Human))
BDBM267998
(4-[2-((R)-3-methylmorpholin-4-yl)-8-(2H-pyrazol-3-...)
Show SMILES CCOC(=O)N=S(C)(=O)c1ccc(cc1)-c1cc(nc2c(nccc12)-c1ccnn1C1CCCCO1)N1CCOC[C@H]1C |r|
Show InChI InChI=1S/C31H36N6O5S/c1-4-41-31(38)35-43(3,39)23-10-8-22(9-11-23)25-19-27(36-16-18-40-20-21(36)2)34-29-24(25)12-14-32-30(29)26-13-15-33-37(26)28-7-5-6-17-42-28/h8-15,19,21,28H,4-7,16-18,20H2,1-3H3/t21-,28?,43?/m1/s1
Reactome pathway
US Patent
n/an/a 9.48n/an/an/an/a7.0n/a
Bayer Pharma Aktiengesellschaft
US Patent
Assay Description
To determine of binding activity of the test compounds, full-length human ATR protein was expressed and purified together with ATRIP as described abo...
US Patent US9549932 (2017)
BindingDB Entry DOI: 10.7270/Q27S7QSC
Serine/threonine-protein kinase ATR
(Homo sapiens (Human))
BDBM267998
(4-[2-((R)-3-methylmorpholin-4-yl)-8-(2H-pyrazol-3-...)
Show SMILES CCOC(=O)N=S(C)(=O)c1ccc(cc1)-c1cc(nc2c(nccc12)-c1ccnn1C1CCCCO1)N1CCOC[C@H]1C |r|
Show InChI InChI=1S/C31H36N6O5S/c1-4-41-31(38)35-43(3,39)23-10-8-22(9-11-23)25-19-27(36-16-18-40-20-21(36)2)34-29-24(25)12-14-32-30(29)26-13-15-33-37(26)28-7-5-6-17-42-28/h8-15,19,21,28H,4-7,16-18,20H2,1-3H3/t21-,28?,43?/m1/s1
Reactome pathway
US Patent
n/an/a 22.8n/an/an/an/a7.0n/a
Bayer Pharma Aktiengesellschaft
US Patent
Assay Description
To determine of binding activity of the test compounds, full-length human ATR protein was expressed and purified together with ATRIP as described abo...
US Patent US9549932 (2017)
BindingDB Entry DOI: 10.7270/Q27S7QSC