BDBM268037 4-(1-ethyl-1H-pyrazol-5-yl)-2-[(3R)-3-methylmorpholin-4-yl]-8-(1H-pyrazol-5-yl)-1,7-naphthyridine::US9549932, 69
SMILES: CCn1nccc1-c1cc(nc2c(nccc12)-c1ccnn1C1CCCCO1)N1CCOC[C@H]1C
InChI Key: InChIKey=JYIVVQFKEKZBCI-QFADGXAASA-N
Data: 1 IC50
Activity Spreadsheet -- Enzyme Inhibition Constant Data from BindingDB
Found 1 hit for monomerid = 268037
Trg + Lig
Ki
nM
ΔG°
kcal/mole
IC50
nM
Kd
nM
EC50/IC50
nM
koff
s-1
kon
M-1s-1
pHTemp
°C
Serine/threonine-protein kinase ATR
(Homo sapiens (Human))
BDBM268037
(4-(1-ethyl-1H-pyrazol-5-yl)-2-[(3R)-3-methylmorpho...)
Show SMILES CCn1nccc1-c1cc(nc2c(nccc12)-c1ccnn1C1CCCCO1)N1CCOC[C@H]1C |r|
Show InChI InChI=1S/C26H31N7O2/c1-3-32-21(8-11-28-32)20-16-23(31-13-15-34-17-18(31)2)30-25-19(20)7-10-27-26(25)22-9-12-29-33(22)24-6-4-5-14-35-24/h7-12,16,18,24H,3-6,13-15,17H2,1-2H3/t18-,24?/m1/s1
Reactome pathway
US Patent
n/an/a 5.34n/an/an/an/a7.0n/a
Bayer Pharma Aktiengesellschaft
US Patent
Assay Description
To determine of binding activity of the test compounds, full-length human ATR protein was expressed and purified together with ATRIP as described abo...
US Patent US9549932 (2017)
BindingDB Entry DOI: 10.7270/Q27S7QSC