BDBM268038 4-(1-methyl-1H-imidazol-5-yl)-2-[(3R)-3-methylmorpholin-4-yl]-8-(1H-pyrazol-5-yl)-1,7-naphthyridine::US9549932, 70
SMILES: C[C@@H]1COCCN1c1cc(-c2cncn2C)c2ccnc(-c3ccnn3C3CCCCO3)c2n1
InChI Key: InChIKey=RKXWBXDNQWKJKL-LIXIDFRTSA-N
Data: 1 IC50
Activity Spreadsheet -- Enzyme Inhibition Constant Data from BindingDB
Found 1 hit for monomerid = 268038
Trg + Lig
Ki
nM
ΔG°
kcal/mole
IC50
nM
Kd
nM
EC50/IC50
nM
koff
s-1
kon
M-1s-1
pHTemp
°C
Serine/threonine-protein kinase ATR
(Homo sapiens (Human))
BDBM268038
(4-(1-methyl-1H-imidazol-5-yl)-2-[(3R)-3-methylmorp...)
Show SMILES C[C@@H]1COCCN1c1cc(-c2cncn2C)c2ccnc(-c3ccnn3C3CCCCO3)c2n1 |r|
Show InChI InChI=1S/C25H29N7O2/c1-17-15-33-12-10-31(17)22-13-19(21-14-26-16-30(21)2)18-6-8-27-25(24(18)29-22)20-7-9-28-32(20)23-5-3-4-11-34-23/h6-9,13-14,16-17,23H,3-5,10-12,15H2,1-2H3/t17-,23?/m1/s1
Reactome pathway
US Patent
n/an/a 5.17n/an/an/an/a7.0n/a
Bayer Pharma Aktiengesellschaft
US Patent
Assay Description
To determine of binding activity of the test compounds, full-length human ATR protein was expressed and purified together with ATRIP as described abo...
US Patent US9549932 (2017)
BindingDB Entry DOI: 10.7270/Q27S7QSC