BDBM268040 4-(2,3-difluorophenyl)-2-[(3R)-3-methylmorpholin-4-yl]-8-(1H-pyrazol-5-yl)-1,7-naphthyridine::US9549932, 72
SMILES: C[C@@H]1COCCN1c1cc(-c2cccc(F)c2F)c2ccnc(-c3ccnn3C3CCCCO3)c2n1
InChI Key: InChIKey=BPBJSPJDVZNEQG-BPNWFJGMSA-N
Data: 1 IC50
Activity Spreadsheet -- Enzyme Inhibition Constant Data from BindingDB
Found 1 hit for monomerid = 268040
Trg + Lig
Ki
nM
ΔG°
kcal/mole
IC50
nM
Kd
nM
EC50/IC50
nM
koff
s-1
kon
M-1s-1
pHTemp
°C
Serine/threonine-protein kinase ATR
(Homo sapiens (Human))
BDBM268040
(4-(2,3-difluorophenyl)-2-[(3R)-3-methylmorpholin-4...)
Show SMILES C[C@@H]1COCCN1c1cc(-c2cccc(F)c2F)c2ccnc(-c3ccnn3C3CCCCO3)c2n1 |r|
Show InChI InChI=1S/C27H27F2N5O2/c1-17-16-35-14-12-33(17)23-15-20(18-5-4-6-21(28)25(18)29)19-8-10-30-27(26(19)32-23)22-9-11-31-34(22)24-7-2-3-13-36-24/h4-6,8-11,15,17,24H,2-3,7,12-14,16H2,1H3/t17-,24?/m1/s1
Reactome pathway
US Patent
n/an/a 6.33n/an/an/an/a7.0n/a
Bayer Pharma Aktiengesellschaft
US Patent
Assay Description
To determine of binding activity of the test compounds, full-length human ATR protein was expressed and purified together with ATRIP as described abo...
US Patent US9549932 (2017)
BindingDB Entry DOI: 10.7270/Q27S7QSC