BDBM268055 N-(4-fluorophenyl)-N-methyl-2-[(3R)-3-methylmorpholin-4-yl]-8-(1H-pyrazol-5-yl)-1,7-naphthyridin-4-amine::US9549932, 87
SMILES: C[C@@H]1COCCN1c1cc(N(C)c2ccc(F)cc2)c2ccnc(-c3ccnn3C3CCCCO3)c2n1
InChI Key: InChIKey=MBTTYMUOMSOGHY-ICCFGIFFSA-N
Data: 1 IC50
Activity Spreadsheet -- Enzyme Inhibition Constant Data from BindingDB
Found 1 hit for monomerid = 268055
Trg + Lig
Ki
nM
ΔG°
kcal/mole
IC50
nM
Kd
nM
EC50/IC50
nM
koff
s-1
kon
M-1s-1
pHTemp
°C
Serine/threonine-protein kinase ATR
(Homo sapiens (Human))
BDBM268055
(N-(4-fluorophenyl)-N-methyl-2-[(3R)-3-methylmorpho...)
Show SMILES C[C@@H]1COCCN1c1cc(N(C)c2ccc(F)cc2)c2ccnc(-c3ccnn3C3CCCCO3)c2n1 |r|
Show InChI InChI=1S/C28H31FN6O2/c1-19-18-36-16-14-34(19)25-17-24(33(2)21-8-6-20(29)7-9-21)22-10-12-30-28(27(22)32-25)23-11-13-31-35(23)26-5-3-4-15-37-26/h6-13,17,19,26H,3-5,14-16,18H2,1-2H3/t19-,26?/m1/s1
Reactome pathway
US Patent
n/an/a 8.71n/an/an/an/a7.0n/a
Bayer Pharma Aktiengesellschaft
US Patent
Assay Description
To determine of binding activity of the test compounds, full-length human ATR protein was expressed and purified together with ATRIP as described abo...
US Patent US9549932 (2017)
BindingDB Entry DOI: 10.7270/Q27S7QSC