BDBM268077 2-[(3R)-3-methylmorpholin-4-yl]-4-(4-methylpiperidin-1-yl)-8-(1H-pyrazol-5-yl)-1,7-naphthyridine::US10772893, Example 109::US9549932, 109
SMILES: CC1CCN(CC1)c1cc(nc2c(nccc12)-c1ccn[nH]1)N1CCOC[C@H]1C
InChI Key:
Data: 2 IC50
Activity Spreadsheet -- Enzyme Inhibition Constant Data from BindingDB
Found 2 hits for monomerid = 268077
Trg + Lig
Ki
nM
ΔG°
kcal/mole
IC50
nM
Kd
nM
EC50/IC50
nM
koff
s-1
kon
M-1s-1
pHTemp
°C
ATR/ATRIP
(Homo sapiens (Human))
BDBM268077
(2-[(3R)-3-methylmorpholin-4-yl]-4-(4-methylpiperid...)
Show SMILES CC1CCN(CC1)c1cc(nc2c(nccc12)-c1ccn[nH]1)N1CCOC[C@H]1C |r|
US Patent
n/an/a 9.14n/an/an/an/an/an/a
BAYER PHARMA AKTIENGESELLSCHAFT
US Patent
Assay Description
To determine of binding activity of the test compounds, full-length human ATR protein was expressed and purified together with ATRIP as described abo...
US Patent US10772893 (2020)
Serine/threonine-protein kinase ATR
(Homo sapiens (Human))
BDBM268077
(2-[(3R)-3-methylmorpholin-4-yl]-4-(4-methylpiperid...)
Show SMILES CC1CCN(CC1)c1cc(nc2c(nccc12)-c1ccn[nH]1)N1CCOC[C@H]1C |r|
Reactome pathway
US Patent
n/an/a 9.14n/an/an/an/a7.0n/a
Bayer Pharma Aktiengesellschaft
US Patent
Assay Description
To determine of binding activity of the test compounds, full-length human ATR protein was expressed and purified together with ATRIP as described abo...
US Patent US9549932 (2017)
BindingDB Entry DOI: 10.7270/Q27S7QSC