BDBM268086 4-(6,7-dihydro-5H-pyrrolo[1,2-a]imidazol-3-yl)-2-[(3R)-3-methylmorpholin-4-yl]-8-(1H-pyrazol-5-yl)-1,7-naphthyridine::US9549932, 118
SMILES: C[C@@H]1COCCN1c1cc(-c2cnc3CCCn23)c2ccnc(-c3ccnn3C3CCCCO3)c2n1
InChI Key: InChIKey=WYNLHHDAYYWSPU-YDONVPIESA-N
Data: 1 IC50
Activity Spreadsheet -- Enzyme Inhibition Constant Data from BindingDB
Found 1 hit for monomerid = 268086
Trg + Lig
Ki
nM
ΔG°
kcal/mole
IC50
nM
Kd
nM
EC50/IC50
nM
koff
s-1
kon
M-1s-1
pHTemp
°C
Serine/threonine-protein kinase ATR
(Homo sapiens (Human))
BDBM268086
(4-(6,7-dihydro-5H-pyrrolo[1,2-a]imidazol-3-yl)-2-[...)
Show SMILES C[C@@H]1COCCN1c1cc(-c2cnc3CCCn23)c2ccnc(-c3ccnn3C3CCCCO3)c2n1 |r|
Show InChI InChI=1S/C27H31N7O2/c1-18-17-35-14-12-32(18)24-15-20(22-16-29-23-5-4-11-33(22)23)19-7-9-28-27(26(19)31-24)21-8-10-30-34(21)25-6-2-3-13-36-25/h7-10,15-16,18,25H,2-6,11-14,17H2,1H3/t18-,25?/m1/s1
Reactome pathway
US Patent
n/an/a 10.1n/an/an/an/a7.0n/a
Bayer Pharma Aktiengesellschaft
US Patent
Assay Description
To determine of binding activity of the test compounds, full-length human ATR protein was expressed and purified together with ATRIP as described abo...
US Patent US9549932 (2017)
BindingDB Entry DOI: 10.7270/Q27S7QSC