BDBM26827 CHEMBL458796::N-[(2E)-5-[benzene(methyl)amido]-1-(2-carbamoylethyl)-2,3-dihydro-1H-1,3-benzodiazol-2-ylidene]-1,2-oxazole-5-carboxamide::acylated 2-aminobenzimidazole, 21
SMILES: CN(C(=O)c1ccccc1)c1ccc2n(CCC(N)=O)c(NC(=O)c3ccno3)nc2c1
InChI Key: InChIKey=XHDJLFMWGGDHMB-UHFFFAOYSA-N
Data: 4 IC50
Activity Spreadsheet -- Enzyme Inhibition Constant Data from BindingDB
Found 4 hits for monomerid = 26827
Trg + Lig
Ki
nM
ΔG°
kcal/mole
IC50
nM
Kd
nM
EC50/IC50
nM
koff
s-1
kon
M-1s-1
pHTemp
°C
Tyrosine-protein kinase ITK/TSK
(Homo sapiens (Human))
BDBM26827
(CHEMBL458796 | N-[(2E)-5-[benzene(methyl)amido]-1-...)
Show SMILES CN(C(=O)c1ccccc1)c1ccc2n(CCC(N)=O)c(NC(=O)c3ccno3)nc2c1
Show InChI InChI=1S/C22H20N6O4/c1-27(21(31)14-5-3-2-4-6-14)15-7-8-17-16(13-15)25-22(28(17)12-10-19(23)29)26-20(30)18-9-11-24-32-18/h2-9,11,13H,10,12H2,1H3,(H2,23,29)(H,25,26,30)
Reactome pathway
n/an/a 100n/an/an/an/a7.022
Boehringer Ingelheim Pharmaceuticals Inc.
Assay Description
Kinase is purified as a GST-fusion protein. The kinase activity is measured using DELFIA which utilizes europium chelate-labeled anti-phosphotyrosine...
Bioorg Med Chem Lett 19: 773-7 (2009)
Article DOI: 10.1016/j.bmcl.2008.12.028
BindingDB Entry DOI: 10.7270/Q2736P62
Tyrosine-protein kinase ITK/TSK
(Homo sapiens (Human))
BDBM26827
(CHEMBL458796 | N-[(2E)-5-[benzene(methyl)amido]-1-...)
Show SMILES CN(C(=O)c1ccccc1)c1ccc2n(CCC(N)=O)c(NC(=O)c3ccno3)nc2c1
Show InChI InChI=1S/C22H20N6O4/c1-27(21(31)14-5-3-2-4-6-14)15-7-8-17-16(13-15)25-22(28(17)12-10-19(23)29)26-20(30)18-9-11-24-32-18/h2-9,11,13H,10,12H2,1H3,(H2,23,29)(H,25,26,30)
Reactome pathway
n/an/a 10n/an/an/an/an/an/a
Johnson & Johnson
Curated by ChEMBL
Assay Description
Inhibition of recombinant ITK (unknown origin) by DELFIA assay
Bioorg Med Chem Lett 18: 5537-40 (2008)
Article DOI: 10.1016/j.bmcl.2008.09.017
BindingDB Entry DOI: 10.7270/Q208655Z
Insulin receptor
(Homo sapiens (Human))
BDBM26827
(CHEMBL458796 | N-[(2E)-5-[benzene(methyl)amido]-1-...)
Show SMILES CN(C(=O)c1ccccc1)c1ccc2n(CCC(N)=O)c(NC(=O)c3ccno3)nc2c1
Show InChI InChI=1S/C22H20N6O4/c1-27(21(31)14-5-3-2-4-6-14)15-7-8-17-16(13-15)25-22(28(17)12-10-19(23)29)26-20(30)18-9-11-24-32-18/h2-9,11,13H,10,12H2,1H3,(H2,23,29)(H,25,26,30)
n/an/a>1.00E+4n/an/an/an/an/an/a
Johnson & Johnson
Curated by ChEMBL
Assay Description
Inhibition of IRK
Bioorg Med Chem Lett 18: 5537-40 (2008)
Article DOI: 10.1016/j.bmcl.2008.09.017
BindingDB Entry DOI: 10.7270/Q208655Z
Insulin receptor
(Homo sapiens (Human))
BDBM26827
(CHEMBL458796 | N-[(2E)-5-[benzene(methyl)amido]-1-...)
Show SMILES CN(C(=O)c1ccccc1)c1ccc2n(CCC(N)=O)c(NC(=O)c3ccno3)nc2c1
Show InChI InChI=1S/C22H20N6O4/c1-27(21(31)14-5-3-2-4-6-14)15-7-8-17-16(13-15)25-22(28(17)12-10-19(23)29)26-20(30)18-9-11-24-32-18/h2-9,11,13H,10,12H2,1H3,(H2,23,29)(H,25,26,30)
n/an/a>6.00E+3n/an/an/an/an/an/a
Boehringer Ingelheim Pharmaceuticals Inc.
Assay Description
Kinase is purified as a GST-fusion protein. The kinase activity is measured using DELFIA which utilizes europium chelate-labeled anti-phosphotyrosine...
Bioorg Med Chem Lett 19: 773-7 (2009)
Article DOI: 10.1016/j.bmcl.2008.12.028
BindingDB Entry DOI: 10.7270/Q2736P62