BDBM2684 3-[3-(dimethylamino)propyl]-3,13,23-triazahexacyclo[14.7.0.0^{2,10}.0^{4,9}.0^{11,15}.0^{17,22}]tricosa-1(16),2(10),4(9),5,7,11(15),17(22),18,20-nonaene-12,14-dione::Bisindolyl deriv. 16::indolocarbazole deriv. 4f
SMILES: CN(C)CCCn1c2ccccc2c2c3C(=O)NC(=O)c3c3c4ccccc4[nH]c3c12
InChI Key: InChIKey=PZTHAMCOXITDIY-UHFFFAOYSA-N
Data: 5 IC50
Activity Spreadsheet -- Enzyme Inhibition Constant Data from BindingDB
Found 5 hits for monomerid = 2684
Trg + Lig
Ki
nM
ΔG°
kcal/mole
IC50
nM
Kd
nM
EC50/IC50
nM
koff
s-1
kon
M-1s-1
pHTemp
°C
cAMP-Dependent Protein Kinase (PKA)
(Bos taurus (bovine))
BDBM2684
(3-[3-(dimethylamino)propyl]-3,13,23-triazahexacycl...)
Show SMILES CN(C)CCCn1c2ccccc2c2c3C(=O)NC(=O)c3c3c4ccccc4[nH]c3c12
Show InChI InChI=1S/C25H22N4O2/c1-28(2)12-7-13-29-17-11-6-4-9-15(17)19-21-20(24(30)27-25(21)31)18-14-8-3-5-10-16(14)26-22(18)23(19)29/h3-6,8-11,26H,7,12-13H2,1-2H3,(H,27,30,31)
n/an/a 260n/an/an/an/an/an/a
Laboratoires Glaxo
Assay Description
The activity of PKC, activated by phosphatidylserine and Ca2+, is measured by its ability to transfer phosphate from [gamma-32P]ATP to lysine-rich hi...
J Biol Chem 266: 15771-81 (1991)
BindingDB Entry DOI: 10.7270/Q2FF3QJ4
cAMP-Dependent Protein Kinase (PKA)
(Rattus norvegicus (rat))
BDBM2684
(3-[3-(dimethylamino)propyl]-3,13,23-triazahexacycl...)
Show SMILES CN(C)CCCn1c2ccccc2c2c3C(=O)NC(=O)c3c3c4ccccc4[nH]c3c12
Show InChI InChI=1S/C25H22N4O2/c1-28(2)12-7-13-29-17-11-6-4-9-15(17)19-21-20(24(30)27-25(21)31)18-14-8-3-5-10-16(14)26-22(18)23(19)29/h3-6,8-11,26H,7,12-13H2,1-2H3,(H,27,30,31)
Reactome pathway
n/an/a 500n/an/an/an/an/an/a
Laboratoires Glaxo
Assay Description
The activity of PKA, activated by cAMP, is measured by its ability to transfer phosphate from [gamma-32P]ATP to histone.
J Biol Chem 266: 15771-81 (1991)
BindingDB Entry DOI: 10.7270/Q2FF3QJ4
cAMP-Dependent Protein Kinase (PKA)
(Bos taurus (bovine))
BDBM2684
(3-[3-(dimethylamino)propyl]-3,13,23-triazahexacycl...)
Show SMILES CN(C)CCCn1c2ccccc2c2c3C(=O)NC(=O)c3c3c4ccccc4[nH]c3c12
Show InChI InChI=1S/C25H22N4O2/c1-28(2)12-7-13-29-17-11-6-4-9-15(17)19-21-20(24(30)27-25(21)31)18-14-8-3-5-10-16(14)26-22(18)23(19)29/h3-6,8-11,26H,7,12-13H2,1-2H3,(H,27,30,31)
n/an/a 2.20E+3n/an/an/an/an/a25
DCR&T, Lilly Spain S.A.
Assay Description
In vitro kinase assay using purified enzyme, was incubated at room temperature with substrate, and test compounds in the presence of ATP/[gamma-33P]A...
Bioorg Med Chem Lett 13: 3841-6 (2003)
Article DOI: 10.1016/S0960-894X(03)00792-3
BindingDB Entry DOI: 10.7270/Q2FN14C5
Cyclin-Dependent Kinase 4 (CDK4)
(Homo sapiens (Human))
BDBM2684
(3-[3-(dimethylamino)propyl]-3,13,23-triazahexacycl...)
Show SMILES CN(C)CCCn1c2ccccc2c2c3C(=O)NC(=O)c3c3c4ccccc4[nH]c3c12
Show InChI InChI=1S/C25H22N4O2/c1-28(2)12-7-13-29-17-11-6-4-9-15(17)19-21-20(24(30)27-25(21)31)18-14-8-3-5-10-16(14)26-22(18)23(19)29/h3-6,8-11,26H,7,12-13H2,1-2H3,(H,27,30,31)
NCI pathway
Reactome pathway
n/an/a 130n/an/an/an/a7.022
DCR&T, Lilly Spain S.A.
Assay Description
In vitro CDK assay using purified enzyme, was incubated at room temperature with substrate, and test compounds in the presence of ATP/[gamma-33P]ATP....
Bioorg Med Chem Lett 13: 3841-6 (2003)
Article DOI: 10.1016/S0960-894X(03)00792-3
BindingDB Entry DOI: 10.7270/Q2FN14C5
Phosphorylase Kinase
(Oryctolagus cuniculus (rabbit))
BDBM2684
(3-[3-(dimethylamino)propyl]-3,13,23-triazahexacycl...)
Show SMILES CN(C)CCCn1c2ccccc2c2c3C(=O)NC(=O)c3c3c4ccccc4[nH]c3c12
Show InChI InChI=1S/C25H22N4O2/c1-28(2)12-7-13-29-17-11-6-4-9-15(17)19-21-20(24(30)27-25(21)31)18-14-8-3-5-10-16(14)26-22(18)23(19)29/h3-6,8-11,26H,7,12-13H2,1-2H3,(H,27,30,31)
n/an/a 200n/an/an/an/an/an/a
Laboratoires Glaxo
Assay Description
The activity of PK is measured by its ability to transfer from [gamma-32P]ATP to phosphorylase b.
J Biol Chem 266: 15771-81 (1991)
BindingDB Entry DOI: 10.7270/Q2FF3QJ4