BDBM26840 N-[(2E)-5-[benzene(methyl)amido]-1-(2-carbamoylethyl)-2,3-dihydro-1H-1,3-benzodiazol-2-ylidene]-5-(pyridin-4-yl)thiophene-2-carboxamide::acylated 2-aminobenzimidazole, 34
SMILES: CN(C(=O)c1ccccc1)c1ccc2n(CCC(N)=O)c(NC(=O)c3ccc(s3)-c3ccncc3)nc2c1
InChI Key: InChIKey=CFHJARLUPRYYAH-UHFFFAOYSA-N
Data: 2 IC50
Activity Spreadsheet -- Enzyme Inhibition Constant Data from BindingDB
Found 2 hits for monomerid = 26840
Trg + Lig
Ki
nM
ΔG°
kcal/mole
IC50
nM
Kd
nM
EC50/IC50
nM
koff
s-1
kon
M-1s-1
pHTemp
°C
Insulin receptor
(Homo sapiens (Human))
BDBM26840
(N-[(2E)-5-[benzene(methyl)amido]-1-(2-carbamoyleth...)
Show SMILES CN(C(=O)c1ccccc1)c1ccc2n(CCC(N)=O)c(NC(=O)c3ccc(s3)-c3ccncc3)nc2c1
Show InChI InChI=1S/C28H24N6O3S/c1-33(27(37)19-5-3-2-4-6-19)20-7-8-22-21(17-20)31-28(34(22)16-13-25(29)35)32-26(36)24-10-9-23(38-24)18-11-14-30-15-12-18/h2-12,14-15,17H,13,16H2,1H3,(H2,29,35)(H,31,32,36)
n/an/a>6.00E+3n/an/an/an/an/an/a
Boehringer Ingelheim Pharmaceuticals Inc.
Assay Description
Kinase is purified as a GST-fusion protein. The kinase activity is measured using DELFIA which utilizes europium chelate-labeled anti-phosphotyrosine...
Bioorg Med Chem Lett 19: 773-7 (2009)
Article DOI: 10.1016/j.bmcl.2008.12.028
BindingDB Entry DOI: 10.7270/Q2736P62
Tyrosine-protein kinase ITK/TSK
(Homo sapiens (Human))
BDBM26840
(N-[(2E)-5-[benzene(methyl)amido]-1-(2-carbamoyleth...)
Show SMILES CN(C(=O)c1ccccc1)c1ccc2n(CCC(N)=O)c(NC(=O)c3ccc(s3)-c3ccncc3)nc2c1
Show InChI InChI=1S/C28H24N6O3S/c1-33(27(37)19-5-3-2-4-6-19)20-7-8-22-21(17-20)31-28(34(22)16-13-25(29)35)32-26(36)24-10-9-23(38-24)18-11-14-30-15-12-18/h2-12,14-15,17H,13,16H2,1H3,(H2,29,35)(H,31,32,36)
Reactome pathway
n/an/a 2n/an/an/an/a7.022
Boehringer Ingelheim Pharmaceuticals Inc.
Assay Description
Kinase is purified as a GST-fusion protein. The kinase activity is measured using DELFIA which utilizes europium chelate-labeled anti-phosphotyrosine...
Bioorg Med Chem Lett 19: 773-7 (2009)
Article DOI: 10.1016/j.bmcl.2008.12.028
BindingDB Entry DOI: 10.7270/Q2736P62