BDBM2685 3-(1H-indol-3-yl)-4-{1-[2-(piperidin-2-yl)ethyl]-1H-indol-3-yl}-2,5-dihydro-1H-pyrrole-2,5-dione::Bisindolyl deriv. 23
SMILES: O=C1NC(=O)C(=C1c1c[nH]c2ccccc12)c1cn(CCC2CCCCN2)c2ccccc12
InChI Key: InChIKey=FZUIMWOIRBMAOH-UHFFFAOYSA-N
Data: 3 IC50
PDB links: 9 PDB IDs contain inhibitors having a similarity of 90% to this monomer.
Activity Spreadsheet -- Enzyme Inhibition Constant Data from BindingDB
Found 3 hits for monomerid = 2685
Trg + Lig
Ki
nM
ΔG°
kcal/mole
IC50
nM
Kd
nM
EC50/IC50
nM
koff
s-1
kon
M-1s-1
pHTemp
°C
cAMP-Dependent Protein Kinase (PKA)
(Bos taurus (bovine))
BDBM2685
(3-(1H-indol-3-yl)-4-{1-[2-(piperidin-2-yl)ethyl]-1...)
Show SMILES O=C1NC(=O)C(=C1c1c[nH]c2ccccc12)c1cn(CCC2CCCCN2)c2ccccc12 |c:5|
Show InChI InChI=1S/C27H26N4O2/c32-26-24(20-15-29-22-10-3-1-8-18(20)22)25(27(33)30-26)21-16-31(23-11-4-2-9-19(21)23)14-12-17-7-5-6-13-28-17/h1-4,8-11,15-17,28-29H,5-7,12-14H2,(H,30,32,33)
n/an/a 5n/an/an/an/an/an/a
Laboratoires Glaxo
Assay Description
The activity of PKC, activated by phosphatidylserine and Ca2+, is measured by its ability to transfer phosphate from [gamma-32P]ATP to lysine-rich hi...
J Biol Chem 266: 15771-81 (1991)
BindingDB Entry DOI: 10.7270/Q2FF3QJ4
Phosphorylase Kinase
(Oryctolagus cuniculus (rabbit))
BDBM2685
(3-(1H-indol-3-yl)-4-{1-[2-(piperidin-2-yl)ethyl]-1...)
Show SMILES O=C1NC(=O)C(=C1c1c[nH]c2ccccc12)c1cn(CCC2CCCCN2)c2ccccc12 |c:5|
Show InChI InChI=1S/C27H26N4O2/c32-26-24(20-15-29-22-10-3-1-8-18(20)22)25(27(33)30-26)21-16-31(23-11-4-2-9-19(21)23)14-12-17-7-5-6-13-28-17/h1-4,8-11,15-17,28-29H,5-7,12-14H2,(H,30,32,33)
n/an/a 400n/an/an/an/an/an/a
Laboratoires Glaxo
Assay Description
The activity of PK is measured by its ability to transfer from [gamma-32P]ATP to phosphorylase b.
J Biol Chem 266: 15771-81 (1991)
BindingDB Entry DOI: 10.7270/Q2FF3QJ4
cAMP-Dependent Protein Kinase (PKA)
(Rattus norvegicus (rat))
BDBM2685
(3-(1H-indol-3-yl)-4-{1-[2-(piperidin-2-yl)ethyl]-1...)
Show SMILES O=C1NC(=O)C(=C1c1c[nH]c2ccccc12)c1cn(CCC2CCCCN2)c2ccccc12 |c:5|
Show InChI InChI=1S/C27H26N4O2/c32-26-24(20-15-29-22-10-3-1-8-18(20)22)25(27(33)30-26)21-16-31(23-11-4-2-9-19(21)23)14-12-17-7-5-6-13-28-17/h1-4,8-11,15-17,28-29H,5-7,12-14H2,(H,30,32,33)
Reactome pathway
n/an/a 1.20E+3n/an/an/an/an/an/a
Laboratoires Glaxo
Assay Description
The activity of PKA, activated by cAMP, is measured by its ability to transfer phosphate from [gamma-32P]ATP to histone.
J Biol Chem 266: 15771-81 (1991)
BindingDB Entry DOI: 10.7270/Q2FF3QJ4