BDBM26855 N-[(2E)-5-[benzene(methyl)amido]-1-(2-carbamoylethyl)-2,3-dihydro-1H-1,3-benzodiazol-2-ylidene]-5-(6-cyanopyridin-3-yl)thiophene-2-carboxamide::acylated 2-aminobenzimidazole, 49
SMILES: CN(C(=O)c1ccccc1)c1ccc2n(CCC(N)=O)c(NC(=O)c3ccc(s3)-c3ccc(nc3)C#N)nc2c1
InChI Key: InChIKey=CKYQXIVHGUEYDB-UHFFFAOYSA-N
Data: 2 IC50
Activity Spreadsheet -- Enzyme Inhibition Constant Data from BindingDB
Found 2 hits for monomerid = 26855
Trg + Lig
Ki
nM
ΔG°
kcal/mole
IC50
nM
Kd
nM
EC50/IC50
nM
koff
s-1
kon
M-1s-1
pHTemp
°C
Insulin receptor
(Homo sapiens (Human))
BDBM26855
(N-[(2E)-5-[benzene(methyl)amido]-1-(2-carbamoyleth...)
Show SMILES CN(C(=O)c1ccccc1)c1ccc2n(CCC(N)=O)c(NC(=O)c3ccc(s3)-c3ccc(nc3)C#N)nc2c1
Show InChI InChI=1S/C29H23N7O3S/c1-35(28(39)18-5-3-2-4-6-18)21-9-10-23-22(15-21)33-29(36(23)14-13-26(31)37)34-27(38)25-12-11-24(40-25)19-7-8-20(16-30)32-17-19/h2-12,15,17H,13-14H2,1H3,(H2,31,37)(H,33,34,38)
n/an/a>6.00E+3n/an/an/an/an/an/a
Boehringer Ingelheim Pharmaceuticals Inc.
Assay Description
Kinase is purified as a GST-fusion protein. The kinase activity is measured using DELFIA which utilizes europium chelate-labeled anti-phosphotyrosine...
Bioorg Med Chem Lett 19: 773-7 (2009)
Article DOI: 10.1016/j.bmcl.2008.12.028
BindingDB Entry DOI: 10.7270/Q2736P62
Tyrosine-protein kinase ITK/TSK
(Homo sapiens (Human))
BDBM26855
(N-[(2E)-5-[benzene(methyl)amido]-1-(2-carbamoyleth...)
Show SMILES CN(C(=O)c1ccccc1)c1ccc2n(CCC(N)=O)c(NC(=O)c3ccc(s3)-c3ccc(nc3)C#N)nc2c1
Show InChI InChI=1S/C29H23N7O3S/c1-35(28(39)18-5-3-2-4-6-18)21-9-10-23-22(15-21)33-29(36(23)14-13-26(31)37)34-27(38)25-12-11-24(40-25)19-7-8-20(16-30)32-17-19/h2-12,15,17H,13-14H2,1H3,(H2,31,37)(H,33,34,38)
Reactome pathway
n/an/a 10n/an/an/an/an/an/a
Boehringer Ingelheim Pharmaceuticals Inc.
Assay Description
Kinase is purified as a GST-fusion protein. The kinase activity is measured using DELFIA which utilizes europium chelate-labeled anti-phosphotyrosine...
Bioorg Med Chem Lett 19: 773-7 (2009)
Article DOI: 10.1016/j.bmcl.2008.12.028
BindingDB Entry DOI: 10.7270/Q2736P62