BDBM26856 N-[(2E)-5-[benzene(methyl)amido]-1-(2-carbamoylethyl)-2,3-dihydro-1H-1,3-benzodiazol-2-ylidene]-5-(6-fluoropyridin-3-yl)thiophene-2-carboxamide::acylated 2-aminobenzimidazole, 50
SMILES: CN(C(=O)c1ccccc1)c1ccc2n(CCC(N)=O)c(NC(=O)c3ccc(s3)-c3ccc(F)nc3)nc2c1
InChI Key: InChIKey=IWXOBLGVEGPHBJ-UHFFFAOYSA-N
Data: 2 IC50
Activity Spreadsheet -- Enzyme Inhibition Constant Data from BindingDB
Found 2 hits for monomerid = 26856
Trg + Lig
Ki
nM
ΔG°
kcal/mole
IC50
nM
Kd
nM
EC50/IC50
nM
koff
s-1
kon
M-1s-1
pHTemp
°C
Insulin receptor
(Homo sapiens (Human))
BDBM26856
(N-[(2E)-5-[benzene(methyl)amido]-1-(2-carbamoyleth...)
Show SMILES CN(C(=O)c1ccccc1)c1ccc2n(CCC(N)=O)c(NC(=O)c3ccc(s3)-c3ccc(F)nc3)nc2c1
Show InChI InChI=1S/C28H23FN6O3S/c1-34(27(38)17-5-3-2-4-6-17)19-8-9-21-20(15-19)32-28(35(21)14-13-25(30)36)33-26(37)23-11-10-22(39-23)18-7-12-24(29)31-16-18/h2-12,15-16H,13-14H2,1H3,(H2,30,36)(H,32,33,37)
n/an/a>6.00E+3n/an/an/an/an/an/a
Boehringer Ingelheim Pharmaceuticals Inc.
Assay Description
Kinase is purified as a GST-fusion protein. The kinase activity is measured using DELFIA which utilizes europium chelate-labeled anti-phosphotyrosine...
Bioorg Med Chem Lett 19: 773-7 (2009)
Article DOI: 10.1016/j.bmcl.2008.12.028
BindingDB Entry DOI: 10.7270/Q2736P62
Tyrosine-protein kinase ITK/TSK
(Homo sapiens (Human))
BDBM26856
(N-[(2E)-5-[benzene(methyl)amido]-1-(2-carbamoyleth...)
Show SMILES CN(C(=O)c1ccccc1)c1ccc2n(CCC(N)=O)c(NC(=O)c3ccc(s3)-c3ccc(F)nc3)nc2c1
Show InChI InChI=1S/C28H23FN6O3S/c1-34(27(38)17-5-3-2-4-6-17)19-8-9-21-20(15-19)32-28(35(21)14-13-25(30)36)33-26(37)23-11-10-22(39-23)18-7-12-24(29)31-16-18/h2-12,15-16H,13-14H2,1H3,(H2,30,36)(H,32,33,37)
Reactome pathway
n/an/a 5n/an/an/an/an/an/a
Boehringer Ingelheim Pharmaceuticals Inc.
Assay Description
Kinase is purified as a GST-fusion protein. The kinase activity is measured using DELFIA which utilizes europium chelate-labeled anti-phosphotyrosine...
Bioorg Med Chem Lett 19: 773-7 (2009)
Article DOI: 10.1016/j.bmcl.2008.12.028
BindingDB Entry DOI: 10.7270/Q2736P62