BDBM268621 US9718825, Example 17
SMILES: Clc1ccc(Cl)c(c1)S(=O)(=O)Nc1ccc(cc1)-c1nc(N2CCNCC2)c2cn[nH]c2n1
InChI Key: InChIKey=QXDDPCSRMMXOFW-UHFFFAOYSA-N
Data: 1 IC50
Activity Spreadsheet -- Enzyme Inhibition Constant Data from BindingDB
Found 1 hit for monomerid = 268621
Trg + Lig
Ki
nM
ΔG°
kcal/mole
IC50
nM
Kd
nM
EC50/IC50
nM
koff
s-1
kon
M-1s-1
pHTemp
°C
Serine/threonine-protein kinase Sgk1
(Homo sapiens (Human))
BDBM268621
(US9718825, Example 17)
Show SMILES Clc1ccc(Cl)c(c1)S(=O)(=O)Nc1ccc(cc1)-c1nc(N2CCNCC2)c2cn[nH]c2n1
Show InChI InChI=1S/C21H19Cl2N7O2S/c22-14-3-6-17(23)18(11-14)33(31,32)29-15-4-1-13(2-5-15)19-26-20-16(12-25-28-20)21(27-19)30-9-7-24-8-10-30/h1-6,11-12,24,29H,7-10H2,(H,25,26,27,28)
Reactome pathway
US Patent
n/an/a<1.20n/an/an/an/a7.4n/a
SANOFI
US Patent
Assay Description
The compounds were tested for serum and glucocorticoid-regulated kinase 1 (SGK-1) inhibitory activity in a substrate phosphorylation assay designed t...
US Patent US9718825 (2017)
BindingDB Entry DOI: 10.7270/Q2VM4F82