BDBM268635 US9718825, Example 36
SMILES: OCCCCOc1nc(nc2[nH]ncc12)-c1ccc(NS(=O)(=O)c2cc(Cl)ccc2Cl)cc1
InChI Key: InChIKey=IITMTXFJUYJIJN-UHFFFAOYSA-N
Data: 1 IC50
Activity Spreadsheet -- Enzyme Inhibition Constant Data from BindingDB
Found 1 hit for monomerid = 268635
Trg + Lig
Ki
nM
ΔG°
kcal/mole
IC50
nM
Kd
nM
EC50/IC50
nM
koff
s-1
kon
M-1s-1
pHTemp
°C
Serine/threonine-protein kinase Sgk1
(Homo sapiens (Human))
BDBM268635
(US9718825, Example 36)
Show SMILES OCCCCOc1nc(nc2[nH]ncc12)-c1ccc(NS(=O)(=O)c2cc(Cl)ccc2Cl)cc1
Show InChI InChI=1S/C21H19Cl2N5O4S/c22-14-5-8-17(23)18(11-14)33(30,31)28-15-6-3-13(4-7-15)19-25-20-16(12-24-27-20)21(26-19)32-10-2-1-9-29/h3-8,11-12,28-29H,1-2,9-10H2,(H,24,25,26,27)
Reactome pathway
US Patent
n/an/a<1.20n/an/an/an/a7.4n/a
SANOFI
US Patent
Assay Description
The compounds were tested for serum and glucocorticoid-regulated kinase 1 (SGK-1) inhibitory activity in a substrate phosphorylation assay designed t...
US Patent US9718825 (2017)
BindingDB Entry DOI: 10.7270/Q2VM4F82