BDBM268650 US9718825, Example 52
SMILES: NCCCNc1nc(nc2[nH]ncc12)-c1ccc(NS(=O)(=O)c2cc(Cl)ccc2Cl)cc1
InChI Key: InChIKey=HYEFZTWCCNFAAH-UHFFFAOYSA-N
Data: 1 IC50
Activity Spreadsheet -- Enzyme Inhibition Constant Data from BindingDB
Found 1 hit for monomerid = 268650
Trg + Lig
Ki
nM
ΔG°
kcal/mole
IC50
nM
Kd
nM
EC50/IC50
nM
koff
s-1
kon
M-1s-1
pHTemp
°C
Serine/threonine-protein kinase Sgk1
(Homo sapiens (Human))
BDBM268650
(US9718825, Example 52)
Show SMILES NCCCNc1nc(nc2[nH]ncc12)-c1ccc(NS(=O)(=O)c2cc(Cl)ccc2Cl)cc1
Show InChI InChI=1S/C20H19Cl2N7O2S/c21-13-4-7-16(22)17(10-13)32(30,31)29-14-5-2-12(3-6-14)18-26-19(24-9-1-8-23)15-11-25-28-20(15)27-18/h2-7,10-11,29H,1,8-9,23H2,(H2,24,25,26,27,28)
Reactome pathway
US Patent
n/an/a<1.20n/an/an/an/a7.4n/a
SANOFI
US Patent
Assay Description
The compounds were tested for serum and glucocorticoid-regulated kinase 1 (SGK-1) inhibitory activity in a substrate phosphorylation assay designed t...
US Patent US9718825 (2017)
BindingDB Entry DOI: 10.7270/Q2VM4F82