BDBM269308 (E)-3-(4-((6-hydroxy-2- (2-isopropylphenyl)- benzo[b]thiophen-3- yl)oxy)phenyl)acrylic acid::US10058534, 4
SMILES: CC(C)c1ccccc1-c1sc2cc(O)ccc2c1Oc1ccc(\C=C\C(O)=O)cc1
InChI Key: InChIKey=OBSUYYXASXMBHB-NTEUORMPSA-N
Data: 4 IC50
Activity Spreadsheet -- Enzyme Inhibition Constant Data from BindingDB
Found 4 hits for monomerid = 269308
Trg + Lig
Ki
nM
ΔG°
kcal/mole
IC50
nM
Kd
nM
EC50/IC50
nM
koff
s-1
kon
M-1s-1
pHTemp
°C
Estrogen receptor
(Homo sapiens (Human))
BDBM269308
((E)-3-(4-((6-hydroxy-2- (2-isopropylphenyl)- benzo...)
Show SMILES CC(C)c1ccccc1-c1sc2cc(O)ccc2c1Oc1ccc(\C=C\C(O)=O)cc1
Show InChI InChI=1S/C26H22O4S/c1-16(2)20-5-3-4-6-21(20)26-25(22-13-10-18(27)15-23(22)31-26)30-19-11-7-17(8-12-19)9-14-24(28)29/h3-16,27H,1-2H3,(H,28,29)/b14-9+
US Patent
n/an/a 6n/an/an/an/a5.137
Novartis AG
US Patent
Assay Description
The ER transcription assay is a reporter assay that is based on the ability of ER to induce transcription from a luciferase reporter gene containing ...
US Patent US10058534 (2018)
BindingDB Entry DOI: 10.7270/Q2M32XSG
Estrogen receptor
(Homo sapiens (Human))
BDBM269308
((E)-3-(4-((6-hydroxy-2- (2-isopropylphenyl)- benzo...)
Show SMILES CC(C)c1ccccc1-c1sc2cc(O)ccc2c1Oc1ccc(\C=C\C(O)=O)cc1
Show InChI InChI=1S/C26H22O4S/c1-16(2)20-5-3-4-6-21(20)26-25(22-13-10-18(27)15-23(22)31-26)30-19-11-7-17(8-12-19)9-14-24(28)29/h3-16,27H,1-2H3,(H,28,29)/b14-9+
n/an/a 6n/an/an/an/an/an/a
Novartis Institutes for BioMedical Research
Curated by ChEMBL
Assay Description
Induction of selective estrogen receptor alpha degradation in human MCF7 cells harboring TK-ERE-Luc assessed as reduction in estradiol-induced transc...
J Med Chem 61: 2837-2864 (2018)
Article DOI: 10.1021/acs.jmedchem.7b01682
BindingDB Entry DOI: 10.7270/Q2TB1986
Estrogen receptor
(Homo sapiens (Human))
BDBM269308
((E)-3-(4-((6-hydroxy-2- (2-isopropylphenyl)- benzo...)
Show SMILES CC(C)c1ccccc1-c1sc2cc(O)ccc2c1Oc1ccc(\C=C\C(O)=O)cc1
Show InChI InChI=1S/C26H22O4S/c1-16(2)20-5-3-4-6-21(20)26-25(22-13-10-18(27)15-23(22)31-26)30-19-11-7-17(8-12-19)9-14-24(28)29/h3-16,27H,1-2H3,(H,28,29)/b14-9+
n/an/a 0.400n/an/an/an/an/an/a
Novartis Institutes for BioMedical Research
Curated by ChEMBL
Assay Description
Induction of selective estrogen receptor alpha degradation in human MCF7 cells after 18 to 24 hrs by in-cell Western analysis
J Med Chem 61: 2837-2864 (2018)
Article DOI: 10.1021/acs.jmedchem.7b01682
BindingDB Entry DOI: 10.7270/Q2TB1986
Estrogen receptor
(Homo sapiens (Human))
BDBM269308
((E)-3-(4-((6-hydroxy-2- (2-isopropylphenyl)- benzo...)
Show SMILES CC(C)c1ccccc1-c1sc2cc(O)ccc2c1Oc1ccc(\C=C\C(O)=O)cc1
Show InChI InChI=1S/C26H22O4S/c1-16(2)20-5-3-4-6-21(20)26-25(22-13-10-18(27)15-23(22)31-26)30-19-11-7-17(8-12-19)9-14-24(28)29/h3-16,27H,1-2H3,(H,28,29)/b14-9+
US Patent
n/an/a 0.400n/an/an/an/a7.425
Novartis AG
US Patent
Assay Description
Plate MCF7 cells at 0.3 million cells/mL (100 l/well) in black, clear-bottom 96-well plates (Greiner, catalog number 655090) in DMEM/F12 media (Gibco...
US Patent US10058534 (2018)
BindingDB Entry DOI: 10.7270/Q2M32XSG