null
SMILES: COCc1ccccc1-c1sc2cc(O)ccc2c1Oc1ccc(\C=C\C(O)=O)cc1
InChI Key: InChIKey=AGYCQIVOHBNYPK-MDWZMJQESA-N
Activity Spreadsheet -- Enzyme Inhibition Constant Data from BindingDB
Found 4 hits for monomerid = 269425
Trg + Lig
Ki
nM
ΔG°
kcal/mole
IC50
nM
Kd
nM
EC50/IC50
nM
koff
s-1
kon
M-1s-1
pHTemp
°C
Estrogen receptor
(Homo sapiens (Human))
BDBM269425
(US10058534, 80)
Show SMILES COCc1ccccc1-c1sc2cc(O)ccc2c1Oc1ccc(\C=C\C(O)=O)cc1
Show InChI InChI=1S/C25H20O5S/c1-29-15-17-4-2-3-5-20(17)25-24(21-12-9-18(26)14-22(21)31-25)30-19-10-6-16(7-11-19)8-13-23(27)28/h2-14,26H,15H2,1H3,(H,27,28)/b13-8+
US Patent
n/an/a 123n/an/an/an/a5.137
Novartis AG
US Patent
Assay Description
The ER transcription assay is a reporter assay that is based on the ability of ER to induce transcription from a luciferase reporter gene containing ...
US Patent US10058534 (2018)
BindingDB Entry DOI: 10.7270/Q2M32XSG
Estrogen receptor
(Homo sapiens (Human))
BDBM269425
(US10058534, 80)
Show SMILES COCc1ccccc1-c1sc2cc(O)ccc2c1Oc1ccc(\C=C\C(O)=O)cc1
Show InChI InChI=1S/C25H20O5S/c1-29-15-17-4-2-3-5-20(17)25-24(21-12-9-18(26)14-22(21)31-25)30-19-10-6-16(7-11-19)8-13-23(27)28/h2-14,26H,15H2,1H3,(H,27,28)/b13-8+
n/an/a 3n/an/an/an/an/an/a
Novartis Institutes for BioMedical Research
Curated by ChEMBL
Assay Description
Induction of selective estrogen receptor alpha degradation in human MCF7 cells after 18 to 24 hrs by in-cell Western analysis
J Med Chem 61: 2837-2864 (2018)
Article DOI: 10.1021/acs.jmedchem.7b01682
BindingDB Entry DOI: 10.7270/Q2TB1986
Estrogen receptor
(Homo sapiens (Human))
BDBM269425
(US10058534, 80)
Show SMILES COCc1ccccc1-c1sc2cc(O)ccc2c1Oc1ccc(\C=C\C(O)=O)cc1
Show InChI InChI=1S/C25H20O5S/c1-29-15-17-4-2-3-5-20(17)25-24(21-12-9-18(26)14-22(21)31-25)30-19-10-6-16(7-11-19)8-13-23(27)28/h2-14,26H,15H2,1H3,(H,27,28)/b13-8+
n/an/a 123n/an/an/an/an/an/a
Novartis Institutes for BioMedical Research
Curated by ChEMBL
Assay Description
Induction of selective estrogen receptor alpha degradation in human MCF7 cells harboring TK-ERE-Luc assessed as reduction in estradiol-induced transc...
J Med Chem 61: 2837-2864 (2018)
Article DOI: 10.1021/acs.jmedchem.7b01682
BindingDB Entry DOI: 10.7270/Q2TB1986
Estrogen receptor
(Homo sapiens (Human))
BDBM269425
(US10058534, 80)
Show SMILES COCc1ccccc1-c1sc2cc(O)ccc2c1Oc1ccc(\C=C\C(O)=O)cc1
Show InChI InChI=1S/C25H20O5S/c1-29-15-17-4-2-3-5-20(17)25-24(21-12-9-18(26)14-22(21)31-25)30-19-10-6-16(7-11-19)8-13-23(27)28/h2-14,26H,15H2,1H3,(H,27,28)/b13-8+
US Patent
n/an/a 3n/an/an/an/a7.425
Novartis AG
US Patent
Assay Description
Plate MCF7 cells at 0.3 million cells/mL (100 l/well) in black, clear-bottom 96-well plates (Greiner, catalog number 655090) in DMEM/F12 media (Gibco...
US Patent US10058534 (2018)
BindingDB Entry DOI: 10.7270/Q2M32XSG