BDBM27002 2-[(3S,14S,17S,18R,20S)-3-[(tert-butylcarbamoyl)amino]-19,19-dimethyl-2,16-dioxo-1,15-diazatricyclo[15.4.0.0^{18,20}]henicosan-14-yl]-N-({[(S)-(dimethylcarbamoyl)(phenyl)methyl]carbamoyl}methyl)-2-oxoacetamide::ketoamide derived macrocyclic inhibitor, 26
SMILES: CN(C)C(=O)[C@@H](NC(=O)CNC(=O)C(=O)[C@@H]1CCCCCCCCCC[C@H](NC(=O)NC(C)(C)C)C(=O)N2C[C@H]3[C@@H]([C@H]2C(=O)N1)C3(C)C)c1ccccc1
InChI Key: InChIKey=MFLYVBSEKPNJNJ-MVTDWJHSSA-N
Data: 1 KI
Activity Spreadsheet -- Enzyme Inhibition Constant Data from BindingDB
Found 1 hit for monomerid = 27002
Trg + Lig
Ki
nM
ΔG°
kcal/mole
IC50
nM
Kd
nM
EC50/IC50
nM
koff
s-1
kon
M-1s-1
pHTemp
°C
HCV NS3-NS4A Serine Proteinase
(Hepatitis C virus (HCV genotype 1a, isolate H))
BDBM27002
(2-[(3S,14S,17S,18R,20S)-3-[(tert-butylcarbamoyl)am...)
Show SMILES CN(C)C(=O)[C@@H](NC(=O)CNC(=O)C(=O)[C@@H]1CCCCCCCCCC[C@H](NC(=O)NC(C)(C)C)C(=O)N2C[C@H]3[C@@H]([C@H]2C(=O)N1)C3(C)C)c1ccccc1 |r|
Show InChI InChI=1S/C40H61N7O7/c1-39(2,3)45-38(54)43-28-22-18-13-11-9-8-10-12-17-21-27(42-34(50)32-30-26(40(30,4)5)24-47(32)36(28)52)33(49)35(51)41-23-29(48)44-31(37(53)46(6)7)25-19-15-14-16-20-25/h14-16,19-20,26-28,30-32H,8-13,17-18,21-24H2,1-7H3,(H,41,51)(H,42,50)(H,44,48)(H2,43,45,54)/t26-,27-,28-,30-,31-,32-/m0/s1
6 -11.4n/an/an/an/an/a6.530
Schering-Plough Research Institute
Assay Description
Proteolytic cleavage of the ester linkage between the Nva (L-norvaline) and the chromophore (PAP) was monitored for change in absorbance at 370 nm. I...
J Med Chem 52: 336-46 (2009)
Article DOI: 10.1021/jm800940u
BindingDB Entry DOI: 10.7270/Q2639N17