BDBM2701 3-[2-(2-aminoethyl)-1H,2H,3H,4H-pyrido[1,2-a]indol-10-yl]-4-(1-methyl-1H-indol-3-yl)-2,5-dihydro-1H-pyrrole-2,5-dione::Bisindolylmaleimide deriv. 9c
SMILES: Cn1cc(C2=C(C(=O)NC2=O)c2c3CC(CCN)CCn3c3ccccc23)c2ccccc12
InChI Key: InChIKey=YCZQYYJVJNOMIJ-UHFFFAOYSA-N
Data: 2 IC50
Activity Spreadsheet -- Enzyme Inhibition Constant Data from BindingDB
Found 2 hits for monomerid = 2701
Trg + Lig
Ki
nM
ΔG°
kcal/mole
IC50
nM
Kd
nM
EC50/IC50
nM
koff
s-1
kon
M-1s-1
pHTemp
°C
cAMP-Dependent Protein Kinase (PKA)
(Bos taurus (bovine))
BDBM2701
(3-[2-(2-aminoethyl)-1H,2H,3H,4H-pyrido[1,2-a]indol...)
Show SMILES Cn1cc(C2=C(C(=O)NC2=O)c2c3CC(CCN)CCn3c3ccccc23)c2ccccc12 |t:4|
Show InChI InChI=1S/C27H26N4O2/c1-30-15-19(17-6-2-4-8-20(17)30)24-25(27(33)29-26(24)32)23-18-7-3-5-9-21(18)31-13-11-16(10-12-28)14-22(23)31/h2-9,15-16H,10-14,28H2,1H3,(H,29,32,33)
n/an/a 2.40E+4n/an/an/an/a8.537
Roche Products Limited
Assay Description
The activity of PKA, activated by cAMP, is measured by its ability to transfer phosphate from [gamma-32P]ATP to histone.
J Med Chem 36: 21-9 (1993)
Article DOI: 10.1021/jm00053a003
BindingDB Entry DOI: 10.7270/Q29P2ZTD
Protein Kinase C
(Rattus norvegicus (rat))
BDBM2701
(3-[2-(2-aminoethyl)-1H,2H,3H,4H-pyrido[1,2-a]indol...)
Show SMILES Cn1cc(C2=C(C(=O)NC2=O)c2c3CC(CCN)CCn3c3ccccc23)c2ccccc12 |t:4|
Show InChI InChI=1S/C27H26N4O2/c1-30-15-19(17-6-2-4-8-20(17)30)24-25(27(33)29-26(24)32)23-18-7-3-5-9-21(18)31-13-11-16(10-12-28)14-22(23)31/h2-9,15-16H,10-14,28H2,1H3,(H,29,32,33)
n/an/a 47n/an/an/an/a7.530
Roche Products Limited
Assay Description
The activity of PKC, activated by phosphatidylerine and Ca2+, is measured by its ability to transfer phosphate from [gamma-32P]ATP to lysine-rich his...
J Med Chem 36: 21-9 (1993)
Article DOI: 10.1021/jm00053a003
BindingDB Entry DOI: 10.7270/Q29P2ZTD