null
SMILES: CN(C[C@@H](NC(=O)N[C@H]1CCCCCCCCC[C@H](NC(=O)[C@@H]2[C@@H]3[C@H](CN2C1=O)C3(C)C)C(=O)C(=O)NCC=C)C(C)(C)C)S(=O)(=O)c1cccs1
InChI Key: InChIKey=PNNXFFAWIIWVKL-YSWXZNAESA-N
Activity Spreadsheet -- Enzyme Inhibition Constant Data from BindingDB
Found 1 hit for monomerid = 27020
Trg + Lig
Ki
nM
ΔG°
kcal/mole
IC50
nM
Kd
nM
EC50/IC50
nM
koff
s-1
kon
M-1s-1
pHTemp
°C
Genome polyprotein
(Hepatitis C virus (HCV genotype 1a, isolate H))
BDBM27020
(2-[(3S,13S,16S,17R,19S)-3-({[(2S)-3,3-dimethyl-1-[...)
Show SMILES CN(C[C@@H](NC(=O)N[C@H]1CCCCCCCCC[C@H](NC(=O)[C@@H]2[C@@H]3[C@H](CN2C1=O)C3(C)C)C(=O)C(=O)NCC=C)C(C)(C)C)S(=O)(=O)c1cccs1 |r|
Show InChI InChI=1S/C37H58N6O7S2/c1-8-20-38-33(46)31(44)25-17-14-12-10-9-11-13-15-18-26(34(47)43-22-24-29(37(24,5)6)30(43)32(45)39-25)40-35(48)41-27(36(2,3)4)23-42(7)52(49,50)28-19-16-21-51-28/h8,16,19,21,24-27,29-30H,1,9-15,17-18,20,22-23H2,2-7H3,(H,38,46)(H,39,45)(H2,40,41,48)/t24-,25-,26-,27+,29-,30-/m0/s1
5 -11.5n/an/an/an/an/a6.530
Schering-Plough Research Institute
Assay Description
Proteolytic cleavage of the ester linkage between the Nva (L-norvaline) and the chromophore (PAP) was monitored for change in absorbance at 370 nm. I...
J Med Chem 52: 336-46 (2009)
Article DOI: 10.1021/jm800940u
BindingDB Entry DOI: 10.7270/Q2639N17