BDBM27032 3-{[(1R,2S,5S)-3-[(2S)-2-({[(2S)-1-(1,1-dioxo-1,2-thiazolidin-2-yl)-3,3-dimethylbutan-2-yl]carbamoyl}amino)-3,3-dimethylbutanoyl]-6,6-dimethyl-3-azabicyclo[3.1.0]hexan-2-yl]formamido}-2-oxo-N-(prop-2-en-1-yl)hexanamide::mono-cyclic sultam derivative, 16
SMILES: CCCC(NC(=O)[C@@H]1[C@@H]2[C@H](CN1C(=O)[C@@H](NC(=O)N[C@H](CN1CCCS1(=O)=O)C(C)(C)C)C(C)(C)C)C2(C)C)C(=O)C(=O)NCC=C
InChI Key: InChIKey=PIMGKMYPCYVKEG-AIXDREQRSA-N
Data: 1 KI
Activity Spreadsheet -- Enzyme Inhibition Constant Data from BindingDB
Found 1 hit for monomerid = 27032
Trg + Lig
Ki
nM
ΔG°
kcal/mole
IC50
nM
Kd
nM
EC50/IC50
nM
koff
s-1
kon
M-1s-1
pHTemp
°C
HCV NS3-NS4A Serine Proteinase
(Hepatitis C virus (HCV genotype 1a, isolate H))
BDBM27032
(3-{[(1R,2S,5S)-3-[(2S)-2-({[(2S)-1-(1,1-dioxo-1,2-...)
Show SMILES CCCC(NC(=O)[C@@H]1[C@@H]2[C@H](CN1C(=O)[C@@H](NC(=O)N[C@H](CN1CCCS1(=O)=O)C(C)(C)C)C(C)(C)C)C2(C)C)C(=O)C(=O)NCC=C |r|
Show InChI InChI=1S/C33H56N6O7S/c1-11-14-21(25(40)28(42)34-15-12-2)35-27(41)24-23-20(33(23,9)10)18-39(24)29(43)26(32(6,7)8)37-30(44)36-22(31(3,4)5)19-38-16-13-17-47(38,45)46/h12,20-24,26H,2,11,13-19H2,1,3-10H3,(H,34,42)(H,35,41)(H2,36,37,44)/t20-,21?,22+,23-,24-,26+/m0/s1
11 -11.0n/an/an/an/an/a6.530
Schering-Plough Research Institute
Assay Description
Proteolytic cleavage of the ester linkage between the Nva (L-norvaline) and the chromophore (PAP) was monitored for change in absorbance at 370 nm. I...
Bioorg Med Chem Lett 19: 1105-9 (2009)
Article DOI: 10.1016/j.bmcl.2008.12.111
BindingDB Entry DOI: 10.7270/Q22B8WBZ