BDBM27033 3-{[(1R,2S,5S)-3-[(2S)-2-({[(2S)-1-(1,1-dioxo-1,2-thiazinan-2-yl)-3,3-dimethylbutan-2-yl]carbamoyl}amino)-3,3-dimethylbutanoyl]-6,6-dimethyl-3-azabicyclo[3.1.0]hexan-2-yl]formamido}-2-oxo-N-(prop-2-en-1-yl)hexanamide::mono-cyclic sultam derivative, 17
SMILES: CCCC(NC(=O)[C@@H]1[C@@H]2[C@H](CN1C(=O)[C@@H](NC(=O)N[C@H](CN1CCCCS1(=O)=O)C(C)(C)C)C(C)(C)C)C2(C)C)C(=O)C(=O)NCC=C
InChI Key: InChIKey=NHOVKNYAJQPULO-QJAMBONQSA-N
Data: 1 KI
Activity Spreadsheet -- Enzyme Inhibition Constant Data from BindingDB
Found 1 hit for monomerid = 27033
Trg + Lig
Ki
nM
ΔG°
kcal/mole
IC50
nM
Kd
nM
EC50/IC50
nM
koff
s-1
kon
M-1s-1
pHTemp
°C
HCV NS3-NS4A Serine Proteinase
(Hepatitis C virus (HCV genotype 1a, isolate H))
BDBM27033
(3-{[(1R,2S,5S)-3-[(2S)-2-({[(2S)-1-(1,1-dioxo-1,2-...)
Show SMILES CCCC(NC(=O)[C@@H]1[C@@H]2[C@H](CN1C(=O)[C@@H](NC(=O)N[C@H](CN1CCCCS1(=O)=O)C(C)(C)C)C(C)(C)C)C2(C)C)C(=O)C(=O)NCC=C |r|
Show InChI InChI=1S/C34H58N6O7S/c1-11-15-22(26(41)29(43)35-16-12-2)36-28(42)25-24-21(34(24,9)10)19-40(25)30(44)27(33(6,7)8)38-31(45)37-23(32(3,4)5)20-39-17-13-14-18-48(39,46)47/h12,21-25,27H,2,11,13-20H2,1,3-10H3,(H,35,43)(H,36,42)(H2,37,38,45)/t21-,22?,23+,24-,25-,27+/m0/s1
6 -11.4n/an/an/an/an/a6.530
Schering-Plough Research Institute
Assay Description
Proteolytic cleavage of the ester linkage between the Nva (L-norvaline) and the chromophore (PAP) was monitored for change in absorbance at 370 nm. I...
Bioorg Med Chem Lett 19: 1105-9 (2009)
Article DOI: 10.1016/j.bmcl.2008.12.111
BindingDB Entry DOI: 10.7270/Q22B8WBZ