BDBM27037 3-{[(1R,2S,5S)-3-[(2S)-2-({[(2S)-1-(1,1-dioxo-2H,3H-1,4,2-thieno[2,3-d][1,2]thiazol-2-yl)-3,3-dimethylbutan-2-yl]carbamoyl}amino)-3,3-dimethylbutanoyl]-6,6-dimethyl-3-azabicyclo[3.1.0]hexan-2-yl]formamido}-2-oxo-N-(prop-2-en-1-yl)hexanamide::bicyclic sultam derivative, 21
SMILES: CCCC(NC(=O)[C@@H]1[C@@H]2[C@H](CN1C(=O)[C@@H](NC(=O)N[C@H](CN1Cc3sccc3S1(=O)=O)C(C)(C)C)C(C)(C)C)C2(C)C)C(=O)C(=O)NCC=C
InChI Key: InChIKey=XRUFCCPNNXOMGW-YEMQHKNJSA-N
Data: 1 KI
Activity Spreadsheet -- Enzyme Inhibition Constant Data from BindingDB
Found 1 hit for monomerid = 27037
Trg + Lig
Ki
nM
ΔG°
kcal/mole
IC50
nM
Kd
nM
EC50/IC50
nM
koff
s-1
kon
M-1s-1
pHTemp
°C
HCV NS3-NS4A Serine Proteinase
(Hepatitis C virus (HCV genotype 1a, isolate H))
BDBM27037
(3-{[(1R,2S,5S)-3-[(2S)-2-({[(2S)-1-(1,1-dioxo-2H,3...)
Show SMILES CCCC(NC(=O)[C@@H]1[C@@H]2[C@H](CN1C(=O)[C@@H](NC(=O)N[C@H](CN1Cc3sccc3S1(=O)=O)C(C)(C)C)C(C)(C)C)C2(C)C)C(=O)C(=O)NCC=C |r|
Show InChI InChI=1S/C35H54N6O7S2/c1-11-13-21(27(42)30(44)36-15-12-2)37-29(43)26-25-20(35(25,9)10)17-41(26)31(45)28(34(6,7)8)39-32(46)38-24(33(3,4)5)19-40-18-22-23(14-16-49-22)50(40,47)48/h12,14,16,20-21,24-26,28H,2,11,13,15,17-19H2,1,3-10H3,(H,36,44)(H,37,43)(H2,38,39,46)/t20-,21?,24+,25-,26-,28+/m0/s1
10 -11.1n/an/an/an/an/a6.530
Schering-Plough Research Institute
Assay Description
Proteolytic cleavage of the ester linkage between the Nva (L-norvaline) and the chromophore (PAP) was monitored for change in absorbance at 370 nm. I...
Bioorg Med Chem Lett 19: 1105-9 (2009)
Article DOI: 10.1016/j.bmcl.2008.12.111
BindingDB Entry DOI: 10.7270/Q22B8WBZ