BDBM27049 3-{[(1R,2S,5S)-3-[(2S)-2-({[(2S)-1-(1,1-dioxo-2,3-dihydro-1,2-benzothiazol-2-yl)-3,3-dimethylbutan-2-yl]carbamoyl}amino)-3,3-dimethylbutanoyl]-6,6-dimethyl-3-azabicyclo[3.1.0]hexan-2-yl]formamido}-2-oxo-N-(prop-2-en-1-yl)heptanamide::bicyclic sultam derivative, 33
SMILES: CCCCC(NC(=O)[C@@H]1[C@@H]2[C@H](CN1C(=O)[C@@H](NC(=O)N[C@H](CN1Cc3ccccc3S1(=O)=O)C(C)(C)C)C(C)(C)C)C2(C)C)C(=O)C(=O)NCC=C
InChI Key: InChIKey=CLEMIVUCKYGPSP-GONYQYDKSA-N
Data: 1 KI
Activity Spreadsheet -- Enzyme Inhibition Constant Data from BindingDB
Found 1 hit for monomerid = 27049
Trg + Lig
Ki
nM
ΔG°
kcal/mole
IC50
nM
Kd
nM
EC50/IC50
nM
koff
s-1
kon
M-1s-1
pHTemp
°C
Genome polyprotein
(Hepatitis C virus (HCV genotype 1a, isolate H))
BDBM27049
(3-{[(1R,2S,5S)-3-[(2S)-2-({[(2S)-1-(1,1-dioxo-2,3-...)
Show SMILES CCCCC(NC(=O)[C@@H]1[C@@H]2[C@H](CN1C(=O)[C@@H](NC(=O)N[C@H](CN1Cc3ccccc3S1(=O)=O)C(C)(C)C)C(C)(C)C)C2(C)C)C(=O)C(=O)NCC=C |r|
Show InChI InChI=1S/C38H58N6O7S/c1-11-13-17-25(30(45)33(47)39-19-12-2)40-32(46)29-28-24(38(28,9)10)21-44(29)34(48)31(37(6,7)8)42-35(49)41-27(36(3,4)5)22-43-20-23-16-14-15-18-26(23)52(43,50)51/h12,14-16,18,24-25,27-29,31H,2,11,13,17,19-22H2,1,3-10H3,(H,39,47)(H,40,46)(H2,41,42,49)/t24-,25?,27+,28-,29-,31+/m0/s1
5 -11.5n/an/an/an/an/a6.530
Schering-Plough Research Institute
Assay Description
Proteolytic cleavage of the ester linkage between the Nva (L-norvaline) and the chromophore (PAP) was monitored for change in absorbance at 370 nm. I...
Bioorg Med Chem Lett 19: 1105-9 (2009)
Article DOI: 10.1016/j.bmcl.2008.12.111
BindingDB Entry DOI: 10.7270/Q22B8WBZ