BDBM270520 (R)-3-(((2-methyl-6-(methyl(4-propylphenyl)amino)-1,2,3,4-tetrahydroisoquinolin-1-yl)methyl)amino)isonicotinic acid::US10059687, Example 14A
SMILES: CCCc1ccc(cc1)N(C)c1ccc2[C@H](CNc3cnccc3C(O)=O)N(C)CCc2c1
InChI Key: InChIKey=VKQWNBYOGQSLEJ-SANMLTNESA-N
Data: 6 IC50
Activity Spreadsheet -- Enzyme Inhibition Constant Data from BindingDB
Found 6 hits for monomerid = 270520
Trg + Lig
Ki
nM
ΔG°
kcal/mole
IC50
nM
Kd
nM
EC50/IC50
nM
koff
s-1
kon
M-1s-1
pHTemp
°C
Lysine-specific demethylase 4C
(Homo sapiens (Human))
BDBM270520
((R)-3-(((2-methyl-6-(methyl(4-propylphenyl)amino)-...)
Show SMILES CCCc1ccc(cc1)N(C)c1ccc2[C@H](CNc3cnccc3C(O)=O)N(C)CCc2c1 |r|
Show InChI InChI=1S/C27H32N4O2/c1-4-5-19-6-8-21(9-7-19)31(3)22-10-11-23-20(16-22)13-15-30(2)26(23)18-29-25-17-28-14-12-24(25)27(32)33/h6-12,14,16-17,26,29H,4-5,13,15,18H2,1-3H3,(H,32,33)/t26-/m0/s1
US Patent
n/an/a 5.50E+3n/an/an/an/an/an/a
Celgene Quanticel Research, Inc.
US Patent
Assay Description
The ability of test compounds to inhibit the activity of JMJD2C was determined in 384-well plate format under the following reaction conditions: 0.3 ...
US Patent US10059687 (2018)
BindingDB Entry DOI: 10.7270/Q2TM7D54
Lysine-specific demethylase 6B
(Homo sapiens (Human))
BDBM270520
((R)-3-(((2-methyl-6-(methyl(4-propylphenyl)amino)-...)
Show SMILES CCCc1ccc(cc1)N(C)c1ccc2[C@H](CNc3cnccc3C(O)=O)N(C)CCc2c1 |r|
Show InChI InChI=1S/C27H32N4O2/c1-4-5-19-6-8-21(9-7-19)31(3)22-10-11-23-20(16-22)13-15-30(2)26(23)18-29-25-17-28-14-12-24(25)27(32)33/h6-12,14,16-17,26,29H,4-5,13,15,18H2,1-3H3,(H,32,33)/t26-/m0/s1
US Patent
n/an/a 5.50E+3n/an/an/an/an/an/a
Celgene Quanticel Research, Inc.
US Patent
Assay Description
The enzymatic assay of JMJD3 activity is based upon Time Resolved-Fluorescence Resonance Energy Transfer (TR-FRET) detection. The ability of test com...
US Patent US10059687 (2018)
BindingDB Entry DOI: 10.7270/Q2TM7D54
Lysine-specific demethylase 5B
(Homo sapiens (Human))
BDBM270520
((R)-3-(((2-methyl-6-(methyl(4-propylphenyl)amino)-...)
Show SMILES CCCc1ccc(cc1)N(C)c1ccc2[C@H](CNc3cnccc3C(O)=O)N(C)CCc2c1 |r|
Show InChI InChI=1S/C27H32N4O2/c1-4-5-19-6-8-21(9-7-19)31(3)22-10-11-23-20(16-22)13-15-30(2)26(23)18-29-25-17-28-14-12-24(25)27(32)33/h6-12,14,16-17,26,29H,4-5,13,15,18H2,1-3H3,(H,32,33)/t26-/m0/s1
US Patent
n/an/a<100n/an/an/an/an/an/a
CELGENE QUANTICEL RESEARCH, INC.
US Patent
Assay Description
Jarid1b: The ability of test compounds to inhibit the activity of Jarid1B was determined in 384-well plate format under the following reaction condit...
US Patent US11001568 (2021)
Lysine-specific demethylase 4C
(Homo sapiens (Human))
BDBM270520
((R)-3-(((2-methyl-6-(methyl(4-propylphenyl)amino)-...)
Show SMILES CCCc1ccc(cc1)N(C)c1ccc2[C@H](CNc3cnccc3C(O)=O)N(C)CCc2c1 |r|
Show InChI InChI=1S/C27H32N4O2/c1-4-5-19-6-8-21(9-7-19)31(3)22-10-11-23-20(16-22)13-15-30(2)26(23)18-29-25-17-28-14-12-24(25)27(32)33/h6-12,14,16-17,26,29H,4-5,13,15,18H2,1-3H3,(H,32,33)/t26-/m0/s1
US Patent
n/an/a 5.50E+3n/an/an/an/an/an/a
CELGENE QUANTICEL RESEARCH, INC.
US Patent
Assay Description
JMJD2C: The ability of test compounds to inhibit the activity of JMJD2C was determined in 384-well plate format under the following reaction conditio...
US Patent US11001568 (2021)
Lysine-specific demethylase 6B
(Homo sapiens (Human))
BDBM270520
((R)-3-(((2-methyl-6-(methyl(4-propylphenyl)amino)-...)
Show SMILES CCCc1ccc(cc1)N(C)c1ccc2[C@H](CNc3cnccc3C(O)=O)N(C)CCc2c1 |r|
Show InChI InChI=1S/C27H32N4O2/c1-4-5-19-6-8-21(9-7-19)31(3)22-10-11-23-20(16-22)13-15-30(2)26(23)18-29-25-17-28-14-12-24(25)27(32)33/h6-12,14,16-17,26,29H,4-5,13,15,18H2,1-3H3,(H,32,33)/t26-/m0/s1
US Patent
n/an/a 5.50E+3n/an/an/an/an/an/a
CELGENE QUANTICEL RESEARCH, INC.
US Patent
Assay Description
JMJD3: The enzymatic assay of JMJD3 activity is based upon Time Resolved-Fluorescence Resonance Energy Transfer (TR-FRET) detection. The ability of t...
US Patent US11001568 (2021)
Lysine-specific demethylase 5B
(Homo sapiens (Human))
BDBM270520
((R)-3-(((2-methyl-6-(methyl(4-propylphenyl)amino)-...)
Show SMILES CCCc1ccc(cc1)N(C)c1ccc2[C@H](CNc3cnccc3C(O)=O)N(C)CCc2c1 |r|
Show InChI InChI=1S/C27H32N4O2/c1-4-5-19-6-8-21(9-7-19)31(3)22-10-11-23-20(16-22)13-15-30(2)26(23)18-29-25-17-28-14-12-24(25)27(32)33/h6-12,14,16-17,26,29H,4-5,13,15,18H2,1-3H3,(H,32,33)/t26-/m0/s1
US Patent
n/an/a<100n/an/an/an/an/an/a
Celgene Quanticel Research, Inc.
US Patent
Assay Description
The ability of test compounds to inhibit the activity of Jarid1B was determined in 384-well plate format under the following reaction conditions: 0.8...
US Patent US10059687 (2018)
BindingDB Entry DOI: 10.7270/Q2TM7D54