BDBM270578 (S)-2-(4-(((8-chloro- 4- (neopentylamino) quinazolin-6- yl)amino)(2- chlorophenyl)methyl- d)-1H-1,2,3-triazol- 1-yl)acetic acid::US10059695, I-10::US10577352, Compound I-10
SMILES: CC(C)(C)CNc1ncnc2c(Cl)cc(NC(c3cn(CC(O)=O)nn3)c3ccccc3Cl)cc12
InChI Key: InChIKey=HFRMICLFXNJUSQ-UHFFFAOYSA-N
Data: 2 IC50  2 EC50
Activity Spreadsheet -- Enzyme Inhibition Constant Data from BindingDB
Found 4 hits for monomerid = 270578
Trg + Lig
Ki
nM
ΔG°
kcal/mole
IC50
nM
Kd
nM
EC50/IC50
nM
koff
s-1
kon
M-1s-1
pHTemp
°C
Epidermal growth factor receptor
(Homo sapiens (Human))
BDBM270578
((S)-2-(4-(((8-chloro- 4- (neopentylamino) quinazol...)
Show SMILES CC(C)(C)CNc1ncnc2c(Cl)cc(NC(c3cn(CC(O)=O)nn3)c3ccccc3Cl)cc12
Show InChI InChI=1S/C24H25Cl2N7O2/c1-24(2,3)12-27-23-16-8-14(9-18(26)21(16)28-13-29-23)30-22(15-6-4-5-7-17(15)25)19-10-33(32-31-19)11-20(34)35/h4-10,13,22,30H,11-12H2,1-3H3,(H,34,35)(H,27,28,29)
US Patent
n/an/a 13n/an/an/an/a7.025
GILEAD SCIENCES, INC.
US Patent
Assay Description
EGFR activity was measured using KinEASE (Cisbio), a time-resolved fluorescence resonance energy transfer (TR-FRET) immunoassay. In this assay, EGFR-...
US Patent US10059695 (2018)
BindingDB Entry DOI: 10.7270/Q2FB54Z6
Epidermal growth factor receptor
(Homo sapiens (Human))
BDBM270578
((S)-2-(4-(((8-chloro- 4- (neopentylamino) quinazol...)
Show SMILES CC(C)(C)CNc1ncnc2c(Cl)cc(NC(c3cn(CC(O)=O)nn3)c3ccccc3Cl)cc12
Show InChI InChI=1S/C24H25Cl2N7O2/c1-24(2,3)12-27-23-16-8-14(9-18(26)21(16)28-13-29-23)30-22(15-6-4-5-7-17(15)25)19-10-33(32-31-19)11-20(34)35/h4-10,13,22,30H,11-12H2,1-3H3,(H,34,35)(H,27,28,29)
US Patent
n/an/an/an/a>1.00E+3n/an/an/an/a
Gilead Sciences, Inc.
US Patent
Assay Description
EGFR activity was measured using KinEASE (Cisbio), a time-resolved fluorescence resonance energy transfer (TR-FRET) immunoassay. In this assay, EGFR-...
US Patent US10577352 (2020)
BindingDB Entry DOI: 10.7270/Q20P12D3
Epidermal growth factor receptor
(Homo sapiens (Human))
BDBM270578
((S)-2-(4-(((8-chloro- 4- (neopentylamino) quinazol...)
Show SMILES CC(C)(C)CNc1ncnc2c(Cl)cc(NC(c3cn(CC(O)=O)nn3)c3ccccc3Cl)cc12
Show InChI InChI=1S/C24H25Cl2N7O2/c1-24(2,3)12-27-23-16-8-14(9-18(26)21(16)28-13-29-23)30-22(15-6-4-5-7-17(15)25)19-10-33(32-31-19)11-20(34)35/h4-10,13,22,30H,11-12H2,1-3H3,(H,34,35)(H,27,28,29)
US Patent
n/an/a 13n/an/an/an/an/an/a
Gilead Sciences, Inc.
US Patent
Assay Description
EGFR activity was measured using KinEASE (Cisbio), a time-resolved fluorescence resonance energy transfer (TR-FRET) immunoassay. In this assay, EGFR-...
US Patent US10577352 (2020)
BindingDB Entry DOI: 10.7270/Q20P12D3
Epidermal growth factor receptor
(Homo sapiens (Human))
BDBM270578
((S)-2-(4-(((8-chloro- 4- (neopentylamino) quinazol...)
Show SMILES CC(C)(C)CNc1ncnc2c(Cl)cc(NC(c3cn(CC(O)=O)nn3)c3ccccc3Cl)cc12
Show InChI InChI=1S/C24H25Cl2N7O2/c1-24(2,3)12-27-23-16-8-14(9-18(26)21(16)28-13-29-23)30-22(15-6-4-5-7-17(15)25)19-10-33(32-31-19)11-20(34)35/h4-10,13,22,30H,11-12H2,1-3H3,(H,34,35)(H,27,28,29)
US Patent
n/an/an/an/a>1.00E+3n/an/a7.025
GILEAD SCIENCES, INC.
US Patent
Assay Description
EGFR activity was measured using KinEASE (Cisbio), a time-resolved fluorescence resonance energy transfer (TR-FRET) immunoassay. In this assay, EGFR-...
US Patent US10059695 (2018)
BindingDB Entry DOI: 10.7270/Q2FB54Z6