BDBM270595 US10059695, II-1::US10577352, Compound II-1::benzyl 4-(4-(((8- chloro-4-((3-chloro- 4- fluorophenyl)amino) quinazolin-6- yl)amino)(phenyl) methyl)-1H-1,2,3- triazol-1- yl)piperidine-1- carboxylate
SMILES: Fc1ccc(Nc2ncnc3c(Cl)cc(NC(c4cn(nn4)C4CCN(CC4)C(=O)OCc4ccccc4)c4ccccc4)cc23)cc1Cl
InChI Key: InChIKey=GGYCDQCSXUHDEN-UHFFFAOYSA-N
Data: 2 IC50
Activity Spreadsheet -- Enzyme Inhibition Constant Data from BindingDB
Found 2 hits for monomerid = 270595
Trg + Lig
Ki
nM
ΔG°
kcal/mole
IC50
nM
Kd
nM
EC50/IC50
nM
koff
s-1
kon
M-1s-1
pHTemp
°C
Epidermal growth factor receptor
(Homo sapiens (Human))
BDBM270595
(US10059695, II-1 | US10577352, Compound II-1 | ben...)
Show SMILES Fc1ccc(Nc2ncnc3c(Cl)cc(NC(c4cn(nn4)C4CCN(CC4)C(=O)OCc4ccccc4)c4ccccc4)cc23)cc1Cl
Show InChI InChI=1S/C36H31Cl2FN8O2/c37-29-18-25(11-12-31(29)39)43-35-28-17-26(19-30(38)34(28)40-22-41-35)42-33(24-9-5-2-6-10-24)32-20-47(45-44-32)27-13-15-46(16-14-27)36(48)49-21-23-7-3-1-4-8-23/h1-12,17-20,22,27,33,42H,13-16,21H2,(H,40,41,43)
US Patent
n/an/a 8.48E+3n/an/an/an/an/an/a
Gilead Sciences, Inc.
US Patent
Assay Description
EGFR activity was measured using KinEASE (Cisbio), a time-resolved fluorescence resonance energy transfer (TR-FRET) immunoassay. In this assay, EGFR-...
US Patent US10577352 (2020)
BindingDB Entry DOI: 10.7270/Q20P12D3
Epidermal growth factor receptor
(Homo sapiens (Human))
BDBM270595
(US10059695, II-1 | US10577352, Compound II-1 | ben...)
Show SMILES Fc1ccc(Nc2ncnc3c(Cl)cc(NC(c4cn(nn4)C4CCN(CC4)C(=O)OCc4ccccc4)c4ccccc4)cc23)cc1Cl
Show InChI InChI=1S/C36H31Cl2FN8O2/c37-29-18-25(11-12-31(29)39)43-35-28-17-26(19-30(38)34(28)40-22-41-35)42-33(24-9-5-2-6-10-24)32-20-47(45-44-32)27-13-15-46(16-14-27)36(48)49-21-23-7-3-1-4-8-23/h1-12,17-20,22,27,33,42H,13-16,21H2,(H,40,41,43)
US Patent
n/an/a 8.48E+3n/an/an/an/a7.025
GILEAD SCIENCES, INC.
US Patent
Assay Description
EGFR activity was measured using KinEASE (Cisbio), a time-resolved fluorescence resonance energy transfer (TR-FRET) immunoassay. In this assay, EGFR-...
US Patent US10059695 (2018)
BindingDB Entry DOI: 10.7270/Q2FB54Z6