BDBM27085 3-{3-[5-(morpholin-4-ylmethyl)-1H-1,3-benzodiazol-2-yl]-1H-pyrazol-4-yl}-1-pyridin-3-ylurea::pyrazole-benzimidazole urea analogue, 14
SMILES: O=C(Nc1c[nH]nc1-c1nc2ccc(CN3CCOCC3)cc2[nH]1)Nc1cccnc1
InChI Key: InChIKey=RAPHAQZUOBFENV-UHFFFAOYSA-N
Data: 4 IC50
Activity Spreadsheet -- Enzyme Inhibition Constant Data from BindingDB
Found 4 hits for monomerid = 27085
Trg + Lig
Ki
nM
ΔG°
kcal/mole
IC50
nM
Kd
nM
EC50/IC50
nM
koff
s-1
kon
M-1s-1
pHTemp
°C
Aurora kinase A
(Homo sapiens (Human))
BDBM27085
(3-{3-[5-(morpholin-4-ylmethyl)-1H-1,3-benzodiazol-...)
Show SMILES O=C(Nc1c[nH]nc1-c1nc2ccc(CN3CCOCC3)cc2[nH]1)Nc1cccnc1
Show InChI InChI=1S/C21H22N8O2/c30-21(24-15-2-1-5-22-11-15)27-18-12-23-28-19(18)20-25-16-4-3-14(10-17(16)26-20)13-29-6-8-31-9-7-29/h1-5,10-12H,6-9,13H2,(H,23,28)(H,25,26)(H2,24,27,30)
NCI pathway
Reactome pathway
n/an/a 13n/an/an/an/a7.022
Astex
Assay Description
Assays for Aurora kinase was performed in a DELFIA format. Aurora enzyme was incubated with test compound and cross-tide substrate in the reaction bu...
J Med Chem 52: 379-88 (2009)
Article DOI: 10.1021/jm800984v
BindingDB Entry DOI: 10.7270/Q2P55KT7
3D
3D Structure (docked)
Cyclin-Dependent Kinase 2 (CDK2)
(Homo sapiens (Human))
BDBM27085
(3-{3-[5-(morpholin-4-ylmethyl)-1H-1,3-benzodiazol-...)
Show SMILES O=C(Nc1c[nH]nc1-c1nc2ccc(CN3CCOCC3)cc2[nH]1)Nc1cccnc1
Show InChI InChI=1S/C21H22N8O2/c30-21(24-15-2-1-5-22-11-15)27-18-12-23-28-19(18)20-25-16-4-3-14(10-17(16)26-20)13-29-6-8-31-9-7-29/h1-5,10-12H,6-9,13H2,(H,23,28)(H,25,26)(H2,24,27,30)
NCI pathway
Reactome pathway
n/an/a 160n/an/an/an/an/an/a
Astex
Assay Description
CDK2/cyclinA activity was determined using a radiometric assay to measure the incorporation of gamma-phosphate from [gamma-33P]-ATP into histone H1. ...
J Med Chem 52: 379-88 (2009)
Article DOI: 10.1021/jm800984v
BindingDB Entry DOI: 10.7270/Q2P55KT7
Cyclin-Dependent Kinase 1 (CDK1)
(Homo sapiens (Human))
BDBM27085
(3-{3-[5-(morpholin-4-ylmethyl)-1H-1,3-benzodiazol-...)
Show SMILES O=C(Nc1c[nH]nc1-c1nc2ccc(CN3CCOCC3)cc2[nH]1)Nc1cccnc1
Show InChI InChI=1S/C21H22N8O2/c30-21(24-15-2-1-5-22-11-15)27-18-12-23-28-19(18)20-25-16-4-3-14(10-17(16)26-20)13-29-6-8-31-9-7-29/h1-5,10-12H,6-9,13H2,(H,23,28)(H,25,26)(H2,24,27,30)
Reactome pathway
n/an/a 290n/an/an/an/an/an/a
Astex
Assay Description
CDK1/cyclinB activity was determined using a radiometric assay to measure the incorporation of gamma-phosphate from [gamma-33P]-ATP into histone H1. ...
J Med Chem 52: 379-88 (2009)
Article DOI: 10.1021/jm800984v
BindingDB Entry DOI: 10.7270/Q2P55KT7
Aurora kinase B
(Homo sapiens (Human))
BDBM27085
(3-{3-[5-(morpholin-4-ylmethyl)-1H-1,3-benzodiazol-...)
Show SMILES O=C(Nc1c[nH]nc1-c1nc2ccc(CN3CCOCC3)cc2[nH]1)Nc1cccnc1
Show InChI InChI=1S/C21H22N8O2/c30-21(24-15-2-1-5-22-11-15)27-18-12-23-28-19(18)20-25-16-4-3-14(10-17(16)26-20)13-29-6-8-31-9-7-29/h1-5,10-12H,6-9,13H2,(H,23,28)(H,25,26)(H2,24,27,30)
Reactome pathway
n/an/a 24n/an/an/an/a8.522
Astex
Assay Description
Assays for Aurora kinase was performed in a DELFIA format. Aurora enzyme was incubated with test compound and cross-tide substrate in the reaction bu...
J Med Chem 52: 379-88 (2009)
Article DOI: 10.1021/jm800984v
BindingDB Entry DOI: 10.7270/Q2P55KT7