BDBM271472 2-(7-(2,5-difluorophenoxy)-4-hydroxy-1-methyl-2-oxo-1,2-dihydroquinoline-3-carboxamido)acetic acid::US10065928, Example 19
SMILES: Cn1c2cc(Oc3cc(F)ccc3F)ccc2c(O)c(C(=O)NCC(O)=O)c1=O
InChI Key: InChIKey=LVEJJKOUCDILMX-UHFFFAOYSA-N
Data: 1 EC50
Activity Spreadsheet -- Enzyme Inhibition Constant Data from BindingDB
Found 1 hit for monomerid = 271472
Trg + Lig
Ki
nM
ΔG°
kcal/mole
IC50
nM
Kd
nM
EC50/IC50
nM
koff
s-1
kon
M-1s-1
pHTemp
°C
Hypoxia-inducible factor 1-alpha
(Homo sapiens (Human))
BDBM271472
(2-(7-(2,5-difluorophenoxy)-4-hydroxy-1-methyl-2-ox...)
Show SMILES Cn1c2cc(Oc3cc(F)ccc3F)ccc2c(O)c(C(=O)NCC(O)=O)c1=O
Show InChI InChI=1S/C19H14F2N2O6/c1-23-13-7-10(29-14-6-9(20)2-5-12(14)21)3-4-11(13)17(26)16(19(23)28)18(27)22-8-15(24)25/h2-7,26H,8H2,1H3,(H,22,27)(H,24,25)
Reactome pathway
US Patent
n/an/an/an/a 2.26E+3n/an/an/an/a
SUNSHINE LAKE PHARMA CO., LTD.
US Patent
Assay Description
The activities of compounds of the invention in inducing erythropoietin (EPO) production were assessed by using human live cancer cell strain Hep3B (...
US Patent US10065928 (2018)
BindingDB Entry DOI: 10.7270/Q2DB83WQ