BDBM27239 6-{[(2S,3S,4R,5R)-5-(6-amino-9H-purin-9-yl)-3,4-dihydroxyoxolan-2-yl]formamido}-N-[(1S)-2-(4-benzoylphenyl)-1-carbamoylethyl]hexanamide::ARC-1013, 13
SMILES: NC(=O)[C@H](Cc1ccc(cc1)C(=O)c1ccccc1)NC(=O)CCCCCNC(=O)[C@H]1O[C@H]([C@H](O)[C@@H]1O)n1cnc2c(N)ncnc12
InChI Key: InChIKey=CZIYSJFBJRVVDO-DRXVFNRASA-N
Data: 1 Kd
Activity Spreadsheet -- Enzyme Inhibition Constant Data from BindingDB
Found 1 hit for monomerid = 27239
Trg + Lig
Ki
nM
ΔG°
kcal/mole
IC50
nM
Kd
nM
EC50/IC50
nM
koff
s-1
kon
M-1s-1
pHTemp
°C
cAMP-Dependent Protein Kinase (PKA)
(Mus musculus (mouse))
BDBM27239
(6-{[(2S,3S,4R,5R)-5-(6-amino-9H-purin-9-yl)-3,4-di...)
Show SMILES NC(=O)[C@H](Cc1ccc(cc1)C(=O)c1ccccc1)NC(=O)CCCCCNC(=O)[C@H]1O[C@H]([C@H](O)[C@@H]1O)n1cnc2c(N)ncnc12 |r|
Show InChI InChI=1S/C32H36N8O7/c33-28-23-30(37-16-36-28)40(17-38-23)32-26(44)25(43)27(47-32)31(46)35-14-6-2-5-9-22(41)39-21(29(34)45)15-18-10-12-20(13-11-18)24(42)19-7-3-1-4-8-19/h1,3-4,7-8,10-13,16-17,21,25-27,32,43-44H,2,5-6,9,14-15H2,(H2,34,45)(H,35,46)(H,39,41)(H2,33,36,37)/t21-,25-,26+,27-,32+/m0/s1
Reactome pathway
n/an/an/a>1.00E+5n/an/an/a7.530
Institute of Chemistry in Estonia
Assay Description
The assay is based on the kinase-bound labeled fluorescent probe can be displaced by competitive inhibitors, which can be registered by measurement o...
J Med Chem 52: 308-21 (2009)
Article DOI: 10.1021/jm800797n
BindingDB Entry DOI: 10.7270/Q2RX99FQ