BDBM2725 3-[2-(2-chloro-3-ethoxy-6-fluorophenyl)cyclopropyl]-1-(5-cyanopyridin-2-yl)urea::N-[cis-2-(2-Chloro-3-ethoxy-6-fluorophenyl)cyclopropyl]-N-[2-(5-cyanopyridyl)]urea::urea-PETT deriv. 10
SMILES: CCOc1ccc(F)c(C2CC2NC(=O)Nc2ccc(cn2)C#N)c1Cl
InChI Key: InChIKey=CBDHDNQKYMVBTK-UHFFFAOYSA-N
Data: 3 IC50
Activity Spreadsheet -- Enzyme Inhibition Constant Data from BindingDB
Found 3 hits for monomerid = 2725
Trg + Lig
Ki
nM
ΔG°
kcal/mole
IC50
nM
Kd
nM
EC50/IC50
nM
koff
s-1
kon
M-1s-1
pHTemp
°C
HIV-1 Reverse Transcriptase
(Human immunodeficiency virus type 1)
BDBM2725
(3-[2-(2-chloro-3-ethoxy-6-fluorophenyl)cyclopropyl...)
Show SMILES CCOc1ccc(F)c(C2CC2NC(=O)Nc2ccc(cn2)C#N)c1Cl
Show InChI InChI=1S/C18H16ClFN4O2/c1-2-26-14-5-4-12(20)16(17(14)19)11-7-13(11)23-18(25)24-15-6-3-10(8-21)9-22-15/h3-6,9,11,13H,2,7H2,1H3,(H2,22,23,24,25)
n/an/a 4.30n/an/an/an/an/an/a
Medivir AB
Assay Description
The IC50 of reverse transcriptase is the concentration that inhibits 50% of recombinant HIV-1 RT RNA-directed DNA polymerase activity in vitro.
J Med Chem 42: 4150-60 (1999)
Article DOI: 10.1021/jm990095j
BindingDB Entry DOI: 10.7270/Q25X273G
HIV-1 Reverse Transcriptase Mutant (K103N)
(Human immunodeficiency virus type 1)
BDBM2725
(3-[2-(2-chloro-3-ethoxy-6-fluorophenyl)cyclopropyl...)
Show SMILES CCOc1ccc(F)c(C2CC2NC(=O)Nc2ccc(cn2)C#N)c1Cl
Show InChI InChI=1S/C18H16ClFN4O2/c1-2-26-14-5-4-12(20)16(17(14)19)11-7-13(11)23-18(25)24-15-6-3-10(8-21)9-22-15/h3-6,9,11,13H,2,7H2,1H3,(H2,22,23,24,25)
n/an/a 183n/an/an/an/an/an/a
Medivir AB
Assay Description
The IC50 of reverse transcriptase is the concentration that inhibits 50% of recombinant HIV-1 RT RNA-directed DNA polymerase activity in vitro.
J Med Chem 42: 4150-60 (1999)
Article DOI: 10.1021/jm990095j
BindingDB Entry DOI: 10.7270/Q25X273G
HIV-1 Reverse Transcriptase Mutant (Y181C)
(Human immunodeficiency virus type 1)
BDBM2725
(3-[2-(2-chloro-3-ethoxy-6-fluorophenyl)cyclopropyl...)
Show SMILES CCOc1ccc(F)c(C2CC2NC(=O)Nc2ccc(cn2)C#N)c1Cl
Show InChI InChI=1S/C18H16ClFN4O2/c1-2-26-14-5-4-12(20)16(17(14)19)11-7-13(11)23-18(25)24-15-6-3-10(8-21)9-22-15/h3-6,9,11,13H,2,7H2,1H3,(H2,22,23,24,25)
n/an/a 130n/an/an/an/an/an/a
Medivir AB
Assay Description
The IC50 of reverse transcriptase is the concentration that inhibits 50% of recombinant HIV-1 RT RNA-directed DNA polymerase activity in vitro.
J Med Chem 42: 4150-60 (1999)
Article DOI: 10.1021/jm990095j
BindingDB Entry DOI: 10.7270/Q25X273G