BDBM273151 (R)-N-benzyl-1-[5-(2,6-difluorophenyl)-7-oxo-6,7-dihydro[1,3]thiazolo[5,4-d]pyrimidin-2-yl]pyrrolidine-2-carboxamide::US10065972, Example 583
SMILES: Fc1cccc(F)c1-c1nc2sc(nc2c(=O)[nH]1)N1CCC[C@@H]1C(=O)NCc1ccccc1
InChI Key:
Data: 1 IC50
Activity Spreadsheet -- Enzyme Inhibition Constant Data from BindingDB
Found 1 hit for monomerid = 273151
Trg + Lig
Ki
nM
ΔG°
kcal/mole
IC50
nM
Kd
nM
EC50/IC50
nM
koff
s-1
kon
M-1s-1
pHTemp
°C
Kynurenine/alpha-aminoadipate aminotransferase, mitochondrial
(Homo sapiens (Human))
BDBM273151
((R)-N-benzyl-1-[5-(2,6-difluorophenyl)-7-oxo-6,7-d...)
Show SMILES Fc1cccc(F)c1-c1nc2sc(nc2c(=O)[nH]1)N1CCC[C@@H]1C(=O)NCc1ccccc1 |r|
Reactome pathway
US Patent
n/an/a 9n/an/an/an/a8.0n/a
MITSUBISHI TANABE PHARMA CORPORATION
US Patent
Assay Description
The inhibitory action of the test compound on human recombinant KAT-II was determined by the following method.To a reaction mixture (45 μL) cont...
US Patent US10065972 (2018)
BindingDB Entry DOI: 10.7270/Q23X88P5