BDBM27348 6-(2-methylpropyl)-2-(pyridin-4-yl)-1H,4H,5H,6H,7H-pyrrolo[3,2-c]pyridin-4-one::Pyrrolopyridinone, 68
SMILES: CC(C)CC1Cc2[nH]c(cc2C(=O)N1)-c1ccncc1
InChI Key: InChIKey=DNQQOYHORIBFLK-UHFFFAOYSA-N
Data: 1 IC50
Activity Spreadsheet -- Enzyme Inhibition Constant Data from BindingDB
Found 1 hit for monomerid = 27348
Trg + Lig
Ki
nM
ΔG°
kcal/mole
IC50
nM
Kd
nM
EC50/IC50
nM
koff
s-1
kon
M-1s-1
pHTemp
°C
Cdc7 Kinase
(Homo sapiens (Human))
BDBM27348
(6-(2-methylpropyl)-2-(pyridin-4-yl)-1H,4H,5H,6H,7H...)
Show SMILES CC(C)CC1Cc2[nH]c(cc2C(=O)N1)-c1ccncc1
Show InChI InChI=1S/C16H19N3O/c1-10(2)7-12-8-15-13(16(20)18-12)9-14(19-15)11-3-5-17-6-4-11/h3-6,9-10,12,19H,7-8H2,1-2H3,(H,18,20)
Reactome pathway
n/an/a 3n/an/an/an/a7.925
Nerviano Medical Sciences Srl
Assay Description
The potency of the compound toward kinase activity was determined using a Dowex resin-based assay. The substrate was phosphorylated by kinase in the ...
J Med Chem 52: 293-307 (2009)
Article DOI: 10.1021/jm800977q
BindingDB Entry DOI: 10.7270/Q27W69JX