BDBM273537 US10071079, Example 320::US10478424, Example 320
SMILES: CC(C)c1c([nH]c2ccc(cc12)C1CCN(CC(=O)N(C)C)CC1)-c1cc(C2CC2)c2ncnn2c1
InChI Key: InChIKey=BDBAPRWWUJKVRX-UHFFFAOYSA-N
Data: 6 IC50
Activity Spreadsheet -- Enzyme Inhibition Constant Data from BindingDB
Found 6 hits for monomerid = 273537
Trg + Lig
Ki
nM
ΔG°
kcal/mole
IC50
nM
Kd
nM
EC50/IC50
nM
koff
s-1
kon
M-1s-1
pHTemp
°C
Toll-like receptor 7
(Homo sapiens (Human))
BDBM273537
(US10071079, Example 320 | US10478424, Example 320)
Show SMILES CC(C)c1c([nH]c2ccc(cc12)C1CCN(CC(=O)N(C)C)CC1)-c1cc(C2CC2)c2ncnn2c1
Show InChI InChI=1S/C29H36N6O/c1-18(2)27-24-13-21(19-9-11-34(12-10-19)16-26(36)33(3)4)7-8-25(24)32-28(27)22-14-23(20-5-6-20)29-30-17-31-35(29)15-22/h7-8,13-15,17-20,32H,5-6,9-12,16H2,1-4H3
US Patent
n/an/a 0.300n/an/an/an/an/a25
Bristol-Myers Squibb Company
US Patent
Assay Description
HEK-Blue-cells (Invivogen) overexpressing human TLR7, TLR8 or TLR9 receptors were used for screening inhibitors of these receptors using an inducible...
US Patent US10071079 (2018)
BindingDB Entry DOI: 10.7270/Q2VD71GV
Toll-like receptor 8
(Homo sapiens (Human))
BDBM273537
(US10071079, Example 320 | US10478424, Example 320)
Show SMILES CC(C)c1c([nH]c2ccc(cc12)C1CCN(CC(=O)N(C)C)CC1)-c1cc(C2CC2)c2ncnn2c1
Show InChI InChI=1S/C29H36N6O/c1-18(2)27-24-13-21(19-9-11-34(12-10-19)16-26(36)33(3)4)7-8-25(24)32-28(27)22-14-23(20-5-6-20)29-30-17-31-35(29)15-22/h7-8,13-15,17-20,32H,5-6,9-12,16H2,1-4H3
US Patent
n/an/a 14.2n/an/an/an/an/a25
Bristol-Myers Squibb Company
US Patent
Assay Description
HEK-Blue-cells (Invivogen) overexpressing human TLR7, TLR8 or TLR9 receptors were used for screening inhibitors of these receptors using an inducible...
US Patent US10071079 (2018)
BindingDB Entry DOI: 10.7270/Q2VD71GV
Toll-like receptor 9
(Homo sapiens (Human))
BDBM273537
(US10071079, Example 320 | US10478424, Example 320)
Show SMILES CC(C)c1c([nH]c2ccc(cc12)C1CCN(CC(=O)N(C)C)CC1)-c1cc(C2CC2)c2ncnn2c1
Show InChI InChI=1S/C29H36N6O/c1-18(2)27-24-13-21(19-9-11-34(12-10-19)16-26(36)33(3)4)7-8-25(24)32-28(27)22-14-23(20-5-6-20)29-30-17-31-35(29)15-22/h7-8,13-15,17-20,32H,5-6,9-12,16H2,1-4H3
US Patent
n/an/a 3.02E+3n/an/an/an/an/an/a
Bristol-Myers Squibb Company
US Patent
Assay Description
HEK-Blue-cells (Invivogen) overexpressing human TLR7, TLR8 or TLR9 receptors were used for screening inhibitors of these receptors using an inducible...
US Patent US10478424 (2019)
BindingDB Entry DOI: 10.7270/Q2QZ2DB0
Toll-like receptor 7
(Homo sapiens (Human))
BDBM273537
(US10071079, Example 320 | US10478424, Example 320)
Show SMILES CC(C)c1c([nH]c2ccc(cc12)C1CCN(CC(=O)N(C)C)CC1)-c1cc(C2CC2)c2ncnn2c1
Show InChI InChI=1S/C29H36N6O/c1-18(2)27-24-13-21(19-9-11-34(12-10-19)16-26(36)33(3)4)7-8-25(24)32-28(27)22-14-23(20-5-6-20)29-30-17-31-35(29)15-22/h7-8,13-15,17-20,32H,5-6,9-12,16H2,1-4H3
US Patent
n/an/a 0.300n/an/an/an/an/an/a
Bristol-Myers Squibb Company
US Patent
Assay Description
HEK-Blue-cells (Invivogen) overexpressing human TLR7, TLR8 or TLR9 receptors were used for screening inhibitors of these receptors using an inducible...
US Patent US10478424 (2019)
BindingDB Entry DOI: 10.7270/Q2QZ2DB0
Toll-like receptor 8
(Homo sapiens (Human))
BDBM273537
(US10071079, Example 320 | US10478424, Example 320)
Show SMILES CC(C)c1c([nH]c2ccc(cc12)C1CCN(CC(=O)N(C)C)CC1)-c1cc(C2CC2)c2ncnn2c1
Show InChI InChI=1S/C29H36N6O/c1-18(2)27-24-13-21(19-9-11-34(12-10-19)16-26(36)33(3)4)7-8-25(24)32-28(27)22-14-23(20-5-6-20)29-30-17-31-35(29)15-22/h7-8,13-15,17-20,32H,5-6,9-12,16H2,1-4H3
US Patent
n/an/a 14.2n/an/an/an/an/an/a
Bristol-Myers Squibb Company
US Patent
Assay Description
HEK-Blue-cells (Invivogen) overexpressing human TLR7, TLR8 or TLR9 receptors were used for screening inhibitors of these receptors using an inducible...
US Patent US10478424 (2019)
BindingDB Entry DOI: 10.7270/Q2QZ2DB0
Toll-like receptor 9
(Homo sapiens (Human))
BDBM273537
(US10071079, Example 320 | US10478424, Example 320)
Show SMILES CC(C)c1c([nH]c2ccc(cc12)C1CCN(CC(=O)N(C)C)CC1)-c1cc(C2CC2)c2ncnn2c1
Show InChI InChI=1S/C29H36N6O/c1-18(2)27-24-13-21(19-9-11-34(12-10-19)16-26(36)33(3)4)7-8-25(24)32-28(27)22-14-23(20-5-6-20)29-30-17-31-35(29)15-22/h7-8,13-15,17-20,32H,5-6,9-12,16H2,1-4H3
US Patent
n/an/a 3.02E+3n/an/an/an/an/a25
Bristol-Myers Squibb Company
US Patent
Assay Description
HEK-Blue-cells (Invivogen) overexpressing human TLR7, TLR8 or TLR9 receptors were used for screening inhibitors of these receptors using an inducible...
US Patent US10071079 (2018)
BindingDB Entry DOI: 10.7270/Q2VD71GV